{"text_format":"1","workbook":"xlsx","n_sheets":8,"sheets":["Instructions","HCFV TCO Dashboard","Summary","Currency","Capital Cost","Operational Cost","Financing","TCO_1"],"not_rendered":{"charts":6,"images":10,"macros":0,"external_links":1,"defined_names":0,"comments":0,"pivot_tables":0},"unopened":[],"bounds":{"document_bytes":16777216,"sheet_cells":100000,"rows_first":2000,"rows_last":500,"rows_between":2000,"halvings":0,"cell_chars":16384,"cell_head_chars":4096},"cells_cut":0,"cells_raw":0,"read":"whole","date_system":"1900"}

{"sheet":"Instructions","index":0,"n_rows":43,"n_cols":6,"rows_kept":43,"cut":false,"hidden":false,"merged":[[42,1,43,14],[29,1,29,3],[17,1,17,3],[18,1,18,3],[24,1,24,3],[25,1,25,3],[26,1,26,3],[18,5,18,13],[24,5,24,13],[25,5,25,13],[36,5,36,13],[32,1,32,3],[36,1,36,3],[28,1,28,13],[19,1,19,3],[19,5,19,13],[9,1,9,3],[10,1,10,3],[9,5,9,13],[8,5,8,13],[10,5,10,13],[8,1,8,3],[14,1,14,13],[15,1,15,3],[16,1,16,3],[11,1,11,3],[1,1,1,13],[3,1,3,13],[26,5,26,13],[29,5,29,13],[12,1,12,3],[11,5,13,13],[15,5,15,13],[16,5,16,13],[17,5,17,13],[20,1,20,3],[20,5,20,13],[21,1,21,3],[21,5,21,13],[5,1,5,8],[35,1,35,3],[35,5,35,13],[22,1,22,13],[33,1,33,3],[33,5,33,13],[34,1,34,3],[34,5,34,13],[23,1,23,3],[23,5,23,13],[30,1,30,3],[30,5,30,13],[31,1,31,3],[31,5,31,13],[32,5,32,13],[27,1,27,3],[27,5,27,13]]}
[]
[null,"HOW TO USE THE DYNAMIC TOTAL COST OF OWNERSHIP DASHBOARD"]
[]
[null,"All cells highlighted Green are Input cells. Values can only be edited in these cells to observe the dynamic changes in the dashboard on the right."]
[]
[null,"All cells highlighted Gray are Fixed cells. These values cannot be edited."]
[]
[]
[null,"CELL NAME",null,null,"FUNCTION","ACTION REQUIRED"]
[null,"Vehicle Holding Period (Year)",null,null,"Editable","Use the drop down menu on Cell C5 to choose the Vehicle holding period from 1 to 10 years "]
[null,"Daily Distance Travelled (km)",null,null,"Editable","Use the arrows on the right to increase/decrease to input Daily Distance Travelled in km"]
[null,"Daily Distance Travelled (mi)",null,null,"Fixed"]
[null,"Annual Distance Travelled (km)",null,null,"Fixed"]
[null,"Annual Distance Travelled (mi)",null,null,"Fixed"]
[]
[null,"Vehicle Purchase Cost",null,null,"Editable","Add number values to input the purchase cost of a HCFV"]
[null,"Tax",null,null,"Editable","Add number values to input Tax levied on the HCFV"]
[null,"Annual Insurance Cost",null,null,"Editable","Add number values to input Annual Insurance cost of the HCFV"]
[null,"Financial Incentive",null,null,"Editable","Add number values to input Total incentives including FAME subsidy & other miscellaneous incentives"]
[]
[null,"Discount Rate",null,null,"Editable","Add percentage values to input the present value of future cash flows at the end of holding period"]
[null,"Resale Rate",null,null,"Editable","Add percentage values to input the resale value of the HCFV at the end of holding period"]
[]
[null,"Terms of Payment",null,null,"Editable","Add number values to input the Total number of years of loan repayment"]
[null,"Interest Rate",null,null,"Editable","Add percentage values to input prevailing interest on HCFV Loans"]
[null,"Equity",null,null,"Editable","Add percentage values to input initial equity payment made for the purchase of the HCFV"]
[null,"Monthly EMI",null,null,"Fixed"]
[null,"Charging Infrastructure Cost",null,null,"Editable","Add number values to input the Total cost of Charging Infrastructure"]
[]
[null,"Staff cost per Month",null,null,"Editable","Add number values to input Total Staff cost incurred in a month"]
[null,"Lithium-Ion Battery Cost",null,null,"Editable","Add number values to input prevailing cost of Li-Ion battery in USD per kWh"]
[]
[null,"Fuel Cost",null,null,"Editable","Add number values to input Total cost per unit of Fuel (in associated fuel units) "]
[null,"Capacity of Battery",null,null,"Editable","Add number values to input capacity of battery for Electric HCFVs in kWh"]
[null,"Number of Battery Replacements",null,null,"Editable","Add number values to input total number of battery replacements for Electric HCFV"]
[null,"Mileage",null,null,"Editable","Add number values to input mileage of different models of HCFVs"]
[null,"Annual Maintenance Cost",null,null,"Editable","Add number values to input the Annual Maintenance cost of an HCFV"]
[]
[]
[null,"NOTES"]
[]
[]
[null,"1. For more details regarding Methodology and TCO calculations, please refer to the research paper. Total Cost of Ownership Analysis of the Impact of Vehicle Usage on the Economic Viability of Electric Vehicles in India, P. Kumar and S. Chakrabarty Transport. Res. Rec., 2020 (1-10)"]

{"sheet":"HCFV TCO Dashboard","index":1,"n_rows":61,"n_cols":48,"rows_kept":61,"cut":false,"hidden":false,"merged":[[2,1,2,3],[14,3,14,5],[16,2,16,5],[4,3,4,5]]}
[null,null,null,null,null,null,null,null,null,null,null,null,null,null,null,null,null,null,null,null,null,null,null,null,null,null,null,null,null,null,null,null,null,null,null,null,"10 YEAR","TCO",null,null,null,null,null,"DYNAMIC","TCO"]
[null,null,null,null,null,null,null,null,null,null,null,null,null,null,null,null,null,null,null,null,null,null,null,null,null,null,null,null,null,null,null,null,null,null,null,null,"e-HCFV (LT)",{"$f":"TCO_1!C11","v":31.691074270759394},null,null,null,null,null,"e-HCFV (LT)",{"$f":"VLOOKUP($C$5,$AR$10:$AV$20,2,0)","v":45.526355098889546}]
[null,null,null,null,null,null,null,null,null,null,null,null,null,null,null,null,null,null,null,null,null,null,null,null,null,null,null,null,null,null,null,null,null,null,null,null,"e-HCFV (HT)",{"$f":"TCO_1!D11","v":48.088518618083015},null,null,null,null,null,"e-HCFV (HT)",{"$f":"VLOOKUP($C$5,$AR$10:$AV$20,3,0)","v":70.271360549335839}]
[null,null,null,null,null,null,null,null,null,null,null,null,null,null,null,null,null,null,null,null,null,null,null,null,null,null,null,null,null,null,null,null,null,null,null,null,"D-HCFV (LT)",{"$f":"TCO_1!E11","v":27.635114078067698},null,null,null,null,null,"D-HCFV (LT)",{"$f":"VLOOKUP($C$5,$AR$10:$AV$20,4,0)","v":36.776722138981015}]
[null,"Vehicle Holding Period (Year)",5,"              Use Drop down to choose Holding Period",null,null,null,null,null,null,null,null,null,null,null,null,null,null,null,null,null,null,null,null,null,null,null,null,null,null,null,null,null,null,null,null,"D-HCFV (HT)",{"$f":"TCO_1!F11","v":35.185385360965903},null,null,null,null,null,"D-HCFV (HT)",{"$f":"VLOOKUP($C$5,$AR$10:$AV$20,5,0)","v":46.540329695030778}]
[]
[null,"Daily Distance Travelled (km)",300,null,"(Use Arrows to input Distance)"]
[null,"Daily Distance Travelled (mi)",{"$f":"C7*0.621371","v":186.41130000000001}]
[]
[null,"Annual Distance Travelled (km)",{"$f":"C7*315","v":94500},null,null,null,null,null,null,null,null,null,null,null,null,null,null,null,null,null,null,null,null,null,null,null,null,null,null,null,null,null,null,null,null,null,"Operational Years","e-HCFV (LT)","e-HCFV (HT)","D-HCFV (LT)","D-HCFV (HT)",null,null,null,"e-HCFV (LT)","e-HCFV (HT)","D-HCFV (LT)","D-HCFV (HT)"]
[null,"Annual Distance Travelled (mi)",{"$f":"C8*315","v":58719.559500000003},null,null,null,null,null,null,null,null,null,null,null,null,null,null,null,null,null,null,null,null,null,null,null,null,null,null,null,null,null,null,null,null,null,"Year 1",{"$f":"TCO_1!C31","v":139.57276770048662},{"$f":"TCO_1!C34","v":228.31322716774324},{"$f":"TCO_1!C37","v":78.759982580781141},{"$f":"TCO_1!C40","v":96.25897128904343},null,null,1,{"$f":"IF($C$5=AR11,AL11:AO11,)","v":0}]
[null,null,null,null,null,null,null,null,null,null,null,null,null,null,null,null,null,null,null,null,null,null,null,null,null,null,null,null,null,null,null,null,null,null,null,null,"Year 2",{"$f":"TCO_1!D31","v":81.708617455339791},{"$f":"TCO_1!D34","v":130.62183928202819},{"$f":"TCO_1!D37","v":54.186867975160204},{"$f":"TCO_1!D40","v":67.382701057037892},null,null,2,{"$f":"IF($C$5=AR12,AL12:AO12,)","v":0}]
[null,null,null,null,null,null,null,null,null,null,null,null,null,null,null,null,null,null,null,null,null,null,null,null,null,null,null,null,null,null,null,null,null,null,null,null,"Year 3",{"$f":"TCO_1!E31","v":61.984950377692243},{"$f":"TCO_1!E34","v":97.539779421516783},{"$f":"TCO_1!E37","v":45.20717818852512},{"$f":"TCO_1!E40","v":56.717319536775406},null,null,3,{"$f":"IF($C$5=AR13,AL13:AO13,)","v":0}]
[null,null,null,null,null,null,null,null,null,null,null,null,null,null,null,null,null,null,null,null,null,null,null,null,null,null,null,null,null,null,null,null,null,null,null,null,"Year 4",{"$f":"TCO_1!F31","v":51.829827508579243},{"$f":"TCO_1!F34","v":80.651695329746758},{"$f":"TCO_1!F37","v":40.181132154889283},{"$f":"TCO_1!F40","v":50.677335562277811},null,null,4,{"$f":"IF($C$5=AR14,AL14:AO14,)","v":0}]
[null,null,"INR",null,null,null,null,null,null,null,null,null,null,null,null,null,null,null,null,null,null,null,null,null,null,null,null,null,null,null,null,null,null,null,null,null,"Year 5",{"$f":"TCO_1!G31","v":45.526355098889546},{"$f":"TCO_1!G34","v":70.271360549335839},{"$f":"TCO_1!G37","v":36.776722138981015},{"$f":"TCO_1!G40","v":46.540329695030778},null,null,5,{"$f":"IF($C$5=AR15,AL15:AO15,)","v":45.526355098889546},70.271360549335839,36.776722138981015,46.540329695030778]
[null,null,null,null,null,null,null,null,null,null,null,null,null,null,null,null,null,null,null,null,null,null,null,null,null,null,null,null,null,null,null,null,null,null,null,null,"Year 6",{"$f":"TCO_1!H31","v":41.166999982670625},{"$f":"TCO_1!H34","v":63.167636144613688},{"$f":"TCO_1!H37","v":34.213541483569593},{"$f":"TCO_1!H40","v":43.39479592645133},null,null,6,{"$f":"IF($C$5=AR16,AL16:AO16,)","v":0}]
[null,null,null,null,null,null,null,null,null,null,null,null,null,null,null,null,null,null,null,null,null,null,null,null,null,null,null,null,null,null,null,null,null,null,null,null,"Year 7",{"$f":"TCO_1!I31","v":37.932763316205893},{"$f":"TCO_1!I34","v":57.953876227936966},{"$f":"TCO_1!I37","v":32.154736338242671},{"$f":"TCO_1!I40","v":40.84694509024223},null,null,7,{"$f":"IF($C$5=AR17,AL17:AO17,)","v":0}]
[null,null,null,null,null,null,null,null,null,null,null,null,null,null,null,null,null,null,null,null,null,null,null,null,null,null,null,null,null,null,null,null,null,null,null,null,"Year 8",{"$f":"TCO_1!J31","v":35.412962747379012},{"$f":"TCO_1!J34","v":53.93526537199088},{"$f":"TCO_1!J37","v":30.429974771175523},{"$f":"TCO_1!J40","v":38.69738096713138},null,null,8,{"$f":"IF($C$5=AR18,AL18:AO18,)","v":0}]
[null,"MODEL","e-HCFV (LT)","e-HCFV (HT)","D-HCFV (LT)","D-HCFV (HT)",null,null,null,null,null,null,null,null,null,null,null,null,null,null,null,null,null,null,null,null,null,null,null,null,null,null,null,null,null,null,"Year 9",{"$f":"TCO_1!K31","v":33.378484038658648},{"$f":"TCO_1!K34","v":50.724586464376607},{"$f":"TCO_1!K37","v":28.94308793260835},{"$f":"TCO_1!K40","v":36.83330565598304},null,null,9,{"$f":"IF($C$5=AR19,AL19:AO19,)","v":0}]
[null,{"$f":"VLOOKUP($C$15,Currency!$B$17:$C$19,2,0)","v":"Vehicle Purchase Cost (₹)"},7000000,11050000,3370000,3941000,null,null,null,null,null,null,null,null,null,null,null,null,null,null,null,null,null,null,null,null,null,null,null,null,null,null,null,null,null,null,"Year 10",{"$f":"TCO_1!L31","v":31.691074270759394},{"$f":"TCO_1!L34","v":48.088518618083015},{"$f":"TCO_1!L37","v":27.635114078067698},{"$f":"TCO_1!L40","v":35.185385360965903},null,null,10,{"$f":"IF($C$5=AR20,AL20:AO20,)","v":0}]
[null,{"$f":"VLOOKUP($C$15,Currency!$B$21:$C$23,2,0)","v":"Road Tax (₹)"},0,0,44147,42545]
[null,{"$f":"VLOOKUP($C$15,Currency!$B$25:$C$27,2,0)","v":"Insurance cost (₹)"},67050,98550,47965,54249]
[null,{"$f":"VLOOKUP($C$15,Currency!$B$29:$C$31,2,0)","v":"Financial Incentive (₹)"},0,0,null,null,null,null,null,null,null,null,null,null,null,null,null,null,null,null,null,null,null,null,null,null,null,null,null,null,null,null,null,null,null,null,null,"e-HCFV (LT)","e-HCFV (HT)","D-HCFV (LT)","D-HCFV (HT)"]
[]
[null,"Discount Rate (%)",0.1,0.1,0.1,0.1]
[null,"Resale Rate (%)",0.2,0.2,0.1,0.1]
[]
[null,{"$f":"VLOOKUP($C$15,Currency!$B$45:$C$47,2,0)","v":"Financing Component (₹)"},null,null,null,null,null,null,null,null,null,null,null,null,null,null,null,null,null,null,null,null,null,null,null,null,null,null,null,null,null,null,null,null,null,null,"Total Fixed Cost",{"$f":"TCO_1!C10/TCO_1!C9","v":19.593481496175272},{"$f":"TCO_1!D10/TCO_1!D9","v":32.984099220229744},{"$f":"TCO_1!E10/TCO_1!E9","v":7.7112934670398383},{"$f":"TCO_1!F10/TCO_1!F9","v":8.9997762095437945}]
[null,"Term of Payment (Years)",7,7,7,7]
[null,"Interest Rate (%)",0.08,0.08,0.11,0.11,null,null,null,null,null,null,null,null,null,null,null,null,null,null,null,null,null,null,null,null,null,null,null,null,null,null,null,null,null,null,"Total Variable Cost",{"$f":"TCO_1!L22/TCO_1!C9","v":12.097592774584124},{"$f":"TCO_1!L23/TCO_1!D9","v":15.10441939785327},{"$f":"TCO_1!L24/TCO_1!E9","v":19.923820611027857},{"$f":"TCO_1!L25/TCO_1!F9","v":26.185609151422106}]
[null,"Equity (%)",0.2,0.2,0.2,0.2,null,null,null,null,null,null,null,null,null,null,null,null,null,null,null,null,null,null,null,null,null,null,null,null,null,null,null,null,null,null,"Total TCO",{"$f":"SUM(AL28:AL30)","v":31.691074270759394},{"$f":"SUM(AM28:AM30)","v":48.088518618083015},{"$f":"SUM(AN28:AN30)","v":27.635114078067694},{"$f":"SUM(AO28:AO30)","v":35.185385360965903}]
[null,{"$f":"VLOOKUP($C$15,Currency!$B$49:$C$51,2,0)","v":"Monthly EMI (₹)"},{"$f":"Financing!B12","v":87616.13398828276},{"$f":"Financing!C12","v":138308.32579578922},{"$f":"Financing!D12","v":46322.564818963241},{"$f":"Financing!E12","v":54171.284258615473}]
[null,{"$f":"VLOOKUP($C$15,Currency!$B$53:$C$55,2,0)","v":"Charging Infrastructure Cost (₹)"},3231000,6300000]
[]
[]
[null,null,null,null,null,null,null,null,null,null,null,null,null,null,null,null,null,null,null,null,null,null,null,null,null,null,null,null,null,null,null,null,null,null,null,null,"Cost Components","e-HCFV (LT)","e-HCFV (HT)","D-HCFV (LT)","D-HCFV (HT)"]
[null,null,null,null,null,null,null,null,null,null,null,null,null,null,null,null,null,null,null,null,null,null,null,null,null,null,null,null,null,null,null,null,null,null,null,null,"Fixed",{"$f":"Summary!B18","v":12057805.255015751},{"$f":"Summary!C18","v":20226449.366846293},{"$f":"Summary!D18","v":4657207.4447929123},{"$f":"Summary!E18","v":5435381.8777236994}]
[null,null,null,null,null,null,null,null,null,null,null,null,null,null,null,null,null,null,null,null,null,null,null,null,null,null,null,null,null,null,null,null,null,null,null,null,"Maintenance",{"$f":"Summary!B22","v":30500},{"$f":"Summary!C22","v":32000},{"$f":"Summary!D22","v":61172},{"$f":"Summary!E22","v":63000}]
[null,{"$f":"VLOOKUP($C$15,Currency!$B$33:$C$35,2,0)","v":"Staff Cost per Month (₹)"},50000,null,null,null,null,null,null,null,null,null,null,null,null,null,null,null,null,null,null,null,null,null,null,null,null,null,null,null,null,null,null,null,null,null,"Battery Replacement",{"$f":"Summary!B23","v":420042},{"$f":"Summary!C23","v":660066},{"$f":"Summary!D23","v":0},{"$f":"Summary!E23","v":0}]
[null,"Lithium-Ion Battery Cost (USD/kWh)",137]
[null,null,null,null,null,null,null,null,null,null,null,null,null,null,null,null,null,null,null,null,null,null,null,null,null,null,null,null,null,null,null,null,null,null,null,null,"Fuel",{"$f":"Summary!B24","v":810000},{"$f":"Summary!C24","v":1030909.0909090908},{"$f":"Summary!D24","v":2403000},{"$f":"Summary!E24","v":3364200}]
[null,"MODEL","e-HCFV (LT)","e-HCFV (HT)","D-HCFV (LT)","D-HCFV (HT)"]
[null,{"$f":"VLOOKUP($C$15,Currency!$B$37:$C$39,2,0)","v":"Fuel cost (₹/kWh; ₹/L)"},6,6,89,89,null,null,null,null,null,null,null,null,null,null,null,null,null,null,null,null,null,null,null,null,null,null,null,null,null,null,null,null,null,null,null,"e-HCFV (LT)","e-HCFV (HT)","D-HCFV (LT)","D-HCFV (HT)"]
[null,"Capacity of Battery (kWh)",350,550]
[null,"Number of Battery Replacements",1,1]
[null,"Mileage (km/kWh; km/L)",0.7,0.55000000000000004,3.5,2.5]
[null,{"$f":"VLOOKUP($C$15,Currency!$B$41:$C$43,2,0)","v":"Annual Maintenance Cost (₹)"},30500,32000,61172,63000,null,null,null,null,null,null,null,null,null,null,null,null,null,null,null,null,null,null,null,null,null,null,null,null,null,null,null,null,null,null,"Fixed Cost",{"$f":"AL28/AL31","v":0.61826498302879285},{"$f":"AM28/AM31","v":0.68590383251744702},0.27903968282004749,0.25578165812922998]
[null,null,null,null,null,null,null,null,null,null,null,null,null,null,null,null,null,null,null,null,null,null,null,null,null,null,null,null,null,null,null,null,null,null,null,null,"Variable Cost",{"$f":"AL30/AL31","v":0.38173501697120715},{"$f":"AM30/AM31","v":0.31409616748255298},0.72096031717995257,0.74421834187076996]
[]
[]
[]
[null,"NOTES",null,null,null,null,null,null,null,null,null,null,null,null,null,null,null,null,null,null,null,null,null,null,null,null,null,null,null,null,null,null,null,null,null,null,null,{"$f":"SUM(AL47:AL51)","v":1},{"$f":"SUM(AM47:AM51)","v":1},{"$f":"SUM(AN47:AN51)","v":1},{"$f":"SUM(AO47:AO51)","v":1}]
[]
[null,"1. Model Key"]
[null,"e-HCFV (LT) = Electric Heavy Commercial Freight Vehicle - Low Tonnage (28 Ton)"]
[null,"e-HCFV (LT) = Electric Heavy Commercial Freight Vehicle - High Tonnage (55 Ton)"]
[null,"D-HCFV (LT) = Diesel Heavy Commercial Freight Vehicle - Low Tonnage (28 Ton)"]
[null,"D-HCFV (HT) =  Diesel Heavy Commercial Freight Vehicle - High Tonnage (55 Ton)"]
[]
[null,"2. Financial Incentives can be added by referencing Department of Heavy Industry's website "]
[null,"https://fame2.heavyindustry.gov.in/ModelUnderFame.aspx"]

{"sheet":"Summary","index":2,"n_rows":29,"n_cols":5,"rows_kept":29,"cut":false,"hidden":false,"merged":[[0,0,0,1],[10,0,10,4],[18,0,18,4],[26,0,26,4]]}
["TRAVEL DETAILS"]
["Number of Vehicle",1]
["Life of Vehicle (yrs)",10]
["Annual drive distance (KM)",{"$f":"'HCFV TCO Dashboard'!C10","v":94500}]
["Total Distance Travel (KM)",{"$f":"B3*B4","v":945000}]
["LIB Cost (USD/kWh)",{"$f":"'HCFV TCO Dashboard'!C40","v":137}]
["USD to INR",73]
["General Inputs","e-HCFV (LT)","e-HCFV (HT)","D-HCFV (LT)","D-HCFV (HT)"]
["Discount rate (%)",{"$f":"'HCFV TCO Dashboard'!C25","v":0.1},{"$f":"'HCFV TCO Dashboard'!D25","v":0.1},{"$f":"'HCFV TCO Dashboard'!E25","v":0.1},{"$f":"'HCFV TCO Dashboard'!F25","v":0.1}]
["Resale rate (%)",{"$f":"'HCFV TCO Dashboard'!C26","v":0.2},{"$f":"'HCFV TCO Dashboard'!D26","v":0.2},{"$f":"'HCFV TCO Dashboard'!E26","v":0.1},{"$f":"'HCFV TCO Dashboard'!F26","v":0.1}]
[]
["Capital Cost","e-HCFV (LT)","e-HCFV (HT)","D - HCFV (LT)","D - HCFV (HT)"]
["Total Vehicle Cost (₹)",{"$f":"'Capital Cost'!B8","v":8826805.2550157513},{"$f":"'Capital Cost'!C8","v":13926449.366846293},{"$f":"'Capital Cost'!D8","v":4657207.4447929123},{"$f":"'Capital Cost'!E8","v":5435381.8777236994}]
["Resale Value (₹)",{"$f":"B13*B10","v":1765361.0510031504},{"$f":"C13*C10","v":2785289.8733692588},{"$f":"D13*D10","v":465720.74447929126},{"$f":"E13*E10","v":543538.18777236994}]
["Total Charging Infrastructure Cost (₹/Vehicle)",{"$f":"'HCFV TCO Dashboard'!C33/Summary!B2","v":3231000},{"$f":"'HCFV TCO Dashboard'!D33/Summary!B2","v":6300000},{"$f":"'Capital Cost'!D19/B2","v":0},{"$f":"'Capital Cost'!E19/B2","v":0}]
["Misc. Cost (₹)",0,0,0,0]
["Financial Incentive (₹)",{"$f":"'HCFV TCO Dashboard'!C23","v":0},{"$f":"'HCFV TCO Dashboard'!D23","v":0},0,0]
["Total Capital Cost (₹) excl. Resale Value",{"$f":"(B13+B15+B16)-B17","v":12057805.255015751},{"$f":"(C13+C15+C16)-C17","v":20226449.366846293},4657207.4447929123,5435381.8777236994]
[]
["Annual Operational Cost","e-HCFV (LT)","e-HCFV (HT)","D-HCFV (LT)","D-HCFV (HT)"]
["Staff Cost (₹)",{"$f":"'Operational Cost'!B4","v":600000},{"$f":"'Operational Cost'!C4","v":600000},{"$f":"'Operational Cost'!D4","v":600000},{"$f":"'Operational Cost'!E4","v":600000}]
["Maintenance Cost (₹)",{"$f":"'Operational Cost'!B18","v":30500},{"$f":"'Operational Cost'!C18","v":32000},{"$f":"'Operational Cost'!D18","v":61172},{"$f":"'Operational Cost'!E18","v":63000}]
["Battery Replacement Cost (₹)*",{"$f":"'Operational Cost'!B27/B3","v":420042},{"$f":"'Operational Cost'!C27/B3","v":660066},{"$f":"'Operational Cost'!D27/B3","v":0}]
["Average Fuel Cost (₹)",{"$f":"'Operational Cost'!B11","v":810000},{"$f":"'Operational Cost'!C11","v":1030909.0909090908},{"$f":"'Operational Cost'!D11","v":2403000},{"$f":"'Operational Cost'!E11","v":3364200}]
["Misc. Cost (₹)",0,0,0,0]
["Total Operational Cost (₹)",{"$f":"(SUM(B21:B25))","v":1860542},{"$f":"(SUM(C21:C25))","v":2322975.0909090908},{"$f":"(SUM(D21:D25))","v":3064172},{"$f":"(SUM(E21:E25))","v":4027200}]
[]
["Total Operational Cost for life of HCFV",{"$f":"B26*$B$3","v":18605420},{"$f":"C26*$B$3","v":23229750.909090906},{"$f":"D26*$B$3","v":30641720},{"$f":"E26*$B$3","v":40272000}]
["Average TCO",{"$f":"TCO_1!C11","v":31.691074270759394},{"$f":"TCO_1!D11","v":48.088518618083015},{"$f":"TCO_1!E11","v":27.635114078067698},{"$f":"TCO_1!F11","v":35.185385360965903}]

{"sheet":"Currency","index":3,"n_rows":55,"n_cols":12,"rows_kept":55,"cut":false,"hidden":true,"merged":[[1,1,1,3],[15,1,15,2],[15,4,15,5],[15,7,15,8],[15,10,15,11]]}
[]
[null,"CURRENCY CONVERSION"]
[]
[null,"USD","INR","Conversion"]
[null,1,73,{"$f":"B5*C5","v":73}]
[]
[null,"EURO","INR","Conversion"]
[null,1,82,{"$f":"B8*C8","v":82}]
[]
[]
[]
[]
[]
[]
[]
[null,"DROP DOWN",null,null,"DASHBOARD TITLE",null,null,"Gallon Calculation",null,null,"DASHBOARD TITLE 2"]
[null,"INR",{"$f":"IF(B17='HCFV TCO Dashboard'!$C$15,\"Vehicle Purchase Cost (₹)\",\"\")","v":"Vehicle Purchase Cost (₹)"},null,"INR",{"$f":"IF(E17='HCFV TCO Dashboard'!C15,\"TCO BY MODELS AT YEAR 10 (₹ / km)\",\"\")","v":"TCO BY MODELS AT YEAR 10 (₹ / km)"},null,"USD",null,null,1,{"$f":"IF('HCFV TCO Dashboard'!$C$5=Currency!K17,\"TCO AT YEAR 1\",\"\")","v":""}]
[null,"USD",{"$f":"IF(B18='HCFV TCO Dashboard'!$C$15,\"Vehicle Purchase Cost ($)\",\"\")","v":""},null,"USD",{"$f":"IF(E18='HCFV TCO Dashboard'!C15,\"TCO BY MODELS AT YEAR 10 ($ / mi)\",\"\")","v":""},null,"Gallon Calculation",{"$f":"IF('[1]Dynamic Ranges for 2W'!$C$15=H17,'[1]Dynamic Ranges for 2W'!F38*3.78,\"-\")","v":"-"},null,2,{"$f":"IF('HCFV TCO Dashboard'!$C$5=Currency!K18,\"TCO AT YEAR 2\",\"\")","v":""}]
[null,"EURO",{"$f":"IF(B19='HCFV TCO Dashboard'!$C$15,\"Vehicle Purchase Cost (€)\",\"\")","v":""},null,"EURO",{"$f":"IF(E19='HCFV TCO Dashboard'!C15,\"TCO BY MODEL AT YEAR 10 (€ / km)\",\"\")","v":""},null,null,null,null,3,{"$f":"IF('HCFV TCO Dashboard'!$C$5=Currency!K19,\"TCO AT YEAR 3\",\"\")","v":""}]
[null,null,null,null,null,null,null,null,null,null,4,{"$f":"IF('HCFV TCO Dashboard'!$C$5=Currency!K20,\"TCO AT YEAR 4\",\"\")","v":""}]
[null,"INR",{"$f":"IF(B21='HCFV TCO Dashboard'!$C$15,\"Road Tax (₹)\",\"\")","v":"Road Tax (₹)"},null,"INR",{"$f":"IF(E21='HCFV TCO Dashboard'!C15,\"TCO BREAKDOWN BY COST AT YEAR 10 (₹ / km)\",\"\")","v":"TCO BREAKDOWN BY COST AT YEAR 10 (₹ / km)"},null,null,null,null,5,{"$f":"IF('HCFV TCO Dashboard'!$C$5=Currency!K21,\"TCO AT YEAR 5\",\"\")","v":"TCO AT YEAR 5"}]
[null,"USD",{"$f":"IF(B22='HCFV TCO Dashboard'!$C$15,\"Road Tax ($)\",\"\")","v":""},null,"USD",{"$f":"IF(E22='HCFV TCO Dashboard'!C15,\"TCO BREAKDOWN BY COST AT YEAR 10 ($ / mi)\",\"\")","v":""},null,null,null,null,6,{"$f":"IF('HCFV TCO Dashboard'!$C$5=Currency!K22,\"TCO AT YEAR 6\",\"\")","v":""}]
[null,"EURO",{"$f":"IF(B23='HCFV TCO Dashboard'!$C$15,\"Road Tax (€)\",\"\")","v":""},null,"EURO",{"$f":"IF(E23='HCFV TCO Dashboard'!C15,\"TCO BREAKDOWN BY COST AT YEAR 10 (€ / km)\",\"\")","v":""},null,null,null,null,7,{"$f":"IF('HCFV TCO Dashboard'!$C$5=Currency!K23,\"TCO AT YEAR 7\",\"\")","v":""}]
[null,null,null,null,null,null,null,null,null,null,8,{"$f":"IF('HCFV TCO Dashboard'!$C$5=Currency!K24,\"TCO AT YEAR 8\",\"\")","v":""}]
[null,"INR",{"$f":"IF(B25='HCFV TCO Dashboard'!$C$15,\"Insurance cost (₹)\",\"\")","v":"Insurance cost (₹)"},null,"INR",{"$f":"IF(E25='HCFV TCO Dashboard'!C15,\"TOTAL COST OF OWNERSHIP OVER YEARS (₹ / km)\",\"\")","v":"TOTAL COST OF OWNERSHIP OVER YEARS (₹ / km)"},null,null,null,null,9,{"$f":"IF('HCFV TCO Dashboard'!$C$5=Currency!K25,\"TCO AT YEAR 9\",\"\")","v":""}]
[null,"USD",{"$f":"IF(B26='HCFV TCO Dashboard'!$C$15,\"Insurance Cost ($)\",\"\")","v":""},null,"USD",{"$f":"IF(E26='HCFV TCO Dashboard'!C15,\"TOTAL COST OF OWNERSHIP OVER YEARS ($ / mi)\",\"\")","v":""},null,null,null,null,10,{"$f":"IF('HCFV TCO Dashboard'!$C$5=Currency!K26,\"TCO AT YEAR 10\",\"\")","v":""}]
[null,"EURO",{"$f":"IF(B27='HCFV TCO Dashboard'!$C$15,\"Insurance Cost (€)\",\"\")","v":""},null,"EURO",{"$f":"IF(E27='HCFV TCO Dashboard'!C15,\"TOTAL COST OF OWNERSHIP OVER YEARS (€ / km)\",\"\")","v":""}]
[]
[null,"INR",{"$f":"IF(B29='HCFV TCO Dashboard'!$C$15,\"Financial Incentive (₹)\",\"\")","v":"Financial Incentive (₹)"}]
[null,"USD",{"$f":"IF(B30='HCFV TCO Dashboard'!$C$15,\"Financial Incentive ($)\",\"\")","v":""}]
[null,"EURO",{"$f":"IF(B31='HCFV TCO Dashboard'!$C$15,\"Financial Incentive (€)\",\"\")","v":""}]
[]
[null,"INR",{"$f":"IF(B33='HCFV TCO Dashboard'!$C$15,\"Staff Cost per Month (₹)\",\"\")","v":"Staff Cost per Month (₹)"}]
[null,"USD",{"$f":"IF(B34='HCFV TCO Dashboard'!$C$15,\"Staff Cost per Month ($)\",\"\")","v":""}]
[null,"EURO",{"$f":"IF(B35='HCFV TCO Dashboard'!$C$15,\"Staff Cost per Month (€)\",\"\")","v":""}]
[]
[null,"INR",{"$f":"IF(B37='HCFV TCO Dashboard'!$C$15,\"Fuel cost (₹/kWh; ₹/L)\",\"\")","v":"Fuel cost (₹/kWh; ₹/L)"}]
[null,"USD",{"$f":"IF(B38='HCFV TCO Dashboard'!$C$15,\"Fuel cost ($/kWh; $/gal)\",\"\")","v":""}]
[null,"EURO",{"$f":"IF(B39='HCFV TCO Dashboard'!$C$15,\"Fuel cost (€/kWh; €/L)\",\"\")","v":""}]
[]
[null,"INR",{"$f":"IF(B41='HCFV TCO Dashboard'!$C$15,\"Annual Maintenance Cost (₹)\",\"\")","v":"Annual Maintenance Cost (₹)"}]
[null,"USD",{"$f":"IF(B42='HCFV TCO Dashboard'!$C$15,\"Annual Maintenance Cost ($)\",\"\")","v":""}]
[null,"EURO",{"$f":"IF(B43='HCFV TCO Dashboard'!$C$15,\"Annual Maintenance Cost (€)\",\"\")","v":""}]
[]
[null,"INR",{"$f":"IF(B45='HCFV TCO Dashboard'!$C$15,\"Financing Component (₹)\",\"\")","v":"Financing Component (₹)"}]
[null,"USD",{"$f":"IF(B46='HCFV TCO Dashboard'!$C$15,\"Financing Component ($)\",\"\")","v":""}]
[null,"EURO",{"$f":"IF(B47='HCFV TCO Dashboard'!$C$15,\"Financing Component (€)\",\"\")","v":""}]
[]
[null,"INR",{"$f":"IF(B49='HCFV TCO Dashboard'!$C$15,\"Monthly EMI (₹)\",\"\")","v":"Monthly EMI (₹)"}]
[null,"USD",{"$f":"IF(B50='HCFV TCO Dashboard'!$C$15,\"Monthly EMI ($)\",\"\")","v":""}]
[null,"EURO",{"$f":"IF(B51='HCFV TCO Dashboard'!$C$15,\"Monthly EMI (€)\",\"\")","v":""}]
[]
[null,"INR",{"$f":"IF(B53='HCFV TCO Dashboard'!$C$15,\"Charging Infrastructure Cost (₹)\",\"\")","v":"Charging Infrastructure Cost (₹)"}]
[null,"USD",{"$f":"IF(B54='HCFV TCO Dashboard'!$C$15,\"Charging Infrastructure Cost ($)\",\"\")","v":""}]
[null,"EURO",{"$f":"IF(B55='HCFV TCO Dashboard'!$C$15,\"Charging Infrastructure Cost (€)\",\"\")","v":""}]

{"sheet":"Capital Cost","index":4,"n_rows":45,"n_cols":5,"rows_kept":45,"cut":false,"hidden":true,"merged":[[51,0,51,4],[26,0,26,4],[31,0,31,4],[36,0,36,4],[41,0,41,4],[46,0,46,4]]}
["Vehicle Cost","e-HCFV (LT)","e-HCFV (HT)","D-HCFV (LT)","D-HCFV (HT)"]
["Purchase Cost (₹)",{"$f":"VLOOKUP('HCFV TCO Dashboard'!$C$15,'Capital Cost'!$A$28:$E$30,2,0)","v":7000000},{"$f":"VLOOKUP('HCFV TCO Dashboard'!$C$15,'Capital Cost'!$A$28:$E$30,3,0)","v":11050000},{"$f":"VLOOKUP('HCFV TCO Dashboard'!$C$15,'Capital Cost'!$A$28:$E$30,4,0)","v":3370000},{"$f":"VLOOKUP('HCFV TCO Dashboard'!$C$15,'Capital Cost'!$A$28:$E$30,5,0)","v":3941000}]
["Tax (₹)",{"$f":"VLOOKUP('HCFV TCO Dashboard'!$C$15,'Capital Cost'!$A$33:$E$35,2,0)","v":0},{"$f":"VLOOKUP('HCFV TCO Dashboard'!$C$15,'Capital Cost'!$A$33:$E$35,3,0)","v":0},{"$f":"VLOOKUP('HCFV TCO Dashboard'!$C$15,'Capital Cost'!$A$33:$E$35,4,0)","v":44147},{"$f":"VLOOKUP('HCFV TCO Dashboard'!$C$15,'Capital Cost'!$A$33:$E$35,5,0)","v":42545}]
["Insurance (₹)",{"$f":"VLOOKUP('HCFV TCO Dashboard'!$C$15,'Capital Cost'!$A$38:$E$40,2,0)","v":67050},{"$f":"VLOOKUP('HCFV TCO Dashboard'!$C$15,'Capital Cost'!$A$38:$E$40,3,0)","v":98550},{"$f":"VLOOKUP('HCFV TCO Dashboard'!$C$15,'Capital Cost'!$A$38:$E$40,4,0)","v":47965},{"$f":"VLOOKUP('HCFV TCO Dashboard'!$C$15,'Capital Cost'!$A$38:$E$40,5,0)","v":54249}]
["Financing Component (₹)",{"$f":"Financing!B17","v":1759755.2550157513},{"$f":"Financing!C17","v":2777899.3668462932},{"$f":"Financing!D17","v":1195095.4447929123},{"$f":"Financing!E17","v":1397587.8777236994}]
["Total Financial Incentive (₹)",0,0,0,0]
["Misc. Cost (₹)",0,0,0,0]
["Total Vehicle Cost (₹)",{"$f":"((B2+B3+B4+B5+B7)-B6)","v":8826805.2550157513},{"$f":"((C2+C3+C4+C5+C7)-C6)","v":13926449.366846293},{"$f":"((D2+D3+D4+D5+D7)-D6)","v":4657207.4447929123},{"$f":"((E2+E3+E4+E5+E7)-E6)","v":5435381.8777236994}]
[]
["Charging Infrastructure Cost","e-HCFV (LT)","e-HCFV (HT)","D-HCFV (LT)","D-HCFV (HT)"]
["No. of Slow Charger (SC)",1,0,0,0]
["Cost of SC per unit (₹)",1800000,1800000,0,0]
["Total Cost of SC (₹)",{"$f":"B11*B12","v":1800000},{"$f":"C11*C12","v":0},{"$f":"D11*D12","v":0},0]
["No. of Fast Charger (FC)",0.17,1,0,0]
["Cost of FC per unit (₹)",5250000,5250000,0,0]
["Total Cost of FC (₹)",{"$f":"B14*B15","v":892500.00000000012},{"$f":"C14*C15","v":5250000},{"$f":"D14*D15","v":0},0]
["Installation cost of Charging Infra (₹)",{"$f":"(B13+B16)*20/100","v":538500},{"$f":"(C13+C16)*20/100","v":1050000},{"$f":"(D13+D16)*20/100","v":0},0]
["Total incentive for Charging Infra (₹)",0,0,0,0]
["Total Cost of Charging Infra (Rs.)",{"$f":"(B13+B16+B17)-B18","v":3231000},{"$f":"(C13+C16+C17)-C18","v":6300000},{"$f":"(D13+D16+D17)-D18","v":0},0]
[]
[]
["Per Km Capital Cost",{"$f":"(B8+B19)/Summary!$B$4","v":127.59582280439949},{"$f":"(C8+C19)/Summary!$B$4","v":214.03650123646872},{"$f":"(D8+D19)/Summary!$B$4","v":49.282618463417059},{"$f":"(E8+E19)/Summary!$B$4","v":57.517268547340734}]
[]
[null,"SC = 120kW; FC=350kW (0.5c charging)","FC= 350 kW (0.5c charging)"]
[]
[]
["PURCHASE COST"]
["INR",{"$f":"IF($A$28='HCFV TCO Dashboard'!$C$15,'HCFV TCO Dashboard'!C20,)","v":7000000},{"$f":"IF($A$28='HCFV TCO Dashboard'!$C$15,'HCFV TCO Dashboard'!D20,)","v":11050000},{"$f":"IF($A$28='HCFV TCO Dashboard'!$C$15,'HCFV TCO Dashboard'!E20,)","v":3370000},{"$f":"IF($A$28='HCFV TCO Dashboard'!$C$15,'HCFV TCO Dashboard'!F20,)","v":3941000}]
["USD",{"$f":"IF($A$29='HCFV TCO Dashboard'!$C$15,'HCFV TCO Dashboard'!C20*Currency!$C$5,)","v":0},{"$f":"IF($A$29='HCFV TCO Dashboard'!$C$15,'HCFV TCO Dashboard'!D20*Currency!$C$5,)","v":0},{"$f":"IF($A$29='HCFV TCO Dashboard'!$C$15,'HCFV TCO Dashboard'!E20*Currency!$C$5,)","v":0},{"$f":"IF($A$29='HCFV TCO Dashboard'!$C$15,'HCFV TCO Dashboard'!F20*Currency!$C$5,)","v":0}]
["EURO",{"$f":"IF($A$30='HCFV TCO Dashboard'!$C$15,'HCFV TCO Dashboard'!C20*Currency!$C$8,)","v":0},{"$f":"IF($A$30='HCFV TCO Dashboard'!$C$15,'HCFV TCO Dashboard'!D20*Currency!$C$8,)","v":0},{"$f":"IF($A$30='HCFV TCO Dashboard'!$C$15,'HCFV TCO Dashboard'!E20*Currency!$C$8,)","v":0},{"$f":"IF($A$30='HCFV TCO Dashboard'!$C$15,'HCFV TCO Dashboard'!F20*Currency!$C$8,)","v":0}]
[]
["TAX"]
["INR",{"$f":"IF($A$33='HCFV TCO Dashboard'!$C$15,'HCFV TCO Dashboard'!C21,)","v":0},{"$f":"IF($A$33='HCFV TCO Dashboard'!$C$15,'HCFV TCO Dashboard'!D21,)","v":0},{"$f":"IF($A$33='HCFV TCO Dashboard'!$C$15,'HCFV TCO Dashboard'!E21,)","v":44147},{"$f":"IF($A$33='HCFV TCO Dashboard'!$C$15,'HCFV TCO Dashboard'!F21,)","v":42545}]
["USD",{"$f":"IF($A$34='HCFV TCO Dashboard'!$C$15,'HCFV TCO Dashboard'!C21*Currency!$C$5,)","v":0},{"$f":"IF($A$34='HCFV TCO Dashboard'!$C$15,'HCFV TCO Dashboard'!D21*Currency!$C$5,)","v":0},{"$f":"IF($A$34='HCFV TCO Dashboard'!$C$15,'HCFV TCO Dashboard'!E21*Currency!$C$5,)","v":0},{"$f":"IF($A$34='HCFV TCO Dashboard'!$C$15,'HCFV TCO Dashboard'!F21*Currency!$C$5,)","v":0}]
["EURO",{"$f":"IF($A$35='HCFV TCO Dashboard'!$C$15,'HCFV TCO Dashboard'!C21*Currency!$C$8,)","v":0},{"$f":"IF($A$35='HCFV TCO Dashboard'!$C$15,'HCFV TCO Dashboard'!D21*Currency!$C$8,)","v":0},{"$f":"IF($A$35='HCFV TCO Dashboard'!$C$15,'HCFV TCO Dashboard'!E21*Currency!$C$8,)","v":0},{"$f":"IF($A$35='HCFV TCO Dashboard'!$C$15,'HCFV TCO Dashboard'!F21*Currency!$C$8,)","v":0}]
[]
["INSURANCE"]
["INR",{"$f":"IF($A$38='HCFV TCO Dashboard'!$C$15,'HCFV TCO Dashboard'!C22,)","v":67050},{"$f":"IF($A$38='HCFV TCO Dashboard'!$C$15,'HCFV TCO Dashboard'!D22,)","v":98550},{"$f":"IF($A$38='HCFV TCO Dashboard'!$C$15,'HCFV TCO Dashboard'!E22,)","v":47965},{"$f":"IF($A$38='HCFV TCO Dashboard'!$C$15,'HCFV TCO Dashboard'!F22,)","v":54249}]
["USD",{"$f":"IF($A$39='HCFV TCO Dashboard'!$C$15,'HCFV TCO Dashboard'!C22*Currency!$C$5,)","v":0},{"$f":"IF($A$39='HCFV TCO Dashboard'!$C$15,'HCFV TCO Dashboard'!D22*Currency!$C$5,)","v":0},{"$f":"IF($A$39='HCFV TCO Dashboard'!$C$15,'HCFV TCO Dashboard'!E22*Currency!$C$5,)","v":0},{"$f":"IF($A$39='HCFV TCO Dashboard'!$C$15,'HCFV TCO Dashboard'!F22*Currency!$C$5,)","v":0}]
["EURO",{"$f":"IF($A$40='HCFV TCO Dashboard'!$C$15,'HCFV TCO Dashboard'!C22*Currency!$C$8,)","v":0},{"$f":"IF($A$40='HCFV TCO Dashboard'!$C$15,'HCFV TCO Dashboard'!D22*Currency!$C$8,)","v":0},{"$f":"IF($A$40='HCFV TCO Dashboard'!$C$15,'HCFV TCO Dashboard'!E22*Currency!$C$8,)","v":0},{"$f":"IF($A$40='HCFV TCO Dashboard'!$C$15,'HCFV TCO Dashboard'!F22*Currency!$C$8,)","v":0}]
[]
["INCENTIVE"]
["INR",{"$f":"IF($A$43='HCFV TCO Dashboard'!$C$15,'HCFV TCO Dashboard'!C23,)","v":0},{"$f":"IF($A$43='HCFV TCO Dashboard'!$C$15,'HCFV TCO Dashboard'!D23,)","v":0},{"$f":"IF($A$43='HCFV TCO Dashboard'!$C$15,'HCFV TCO Dashboard'!E23,)","v":0},{"$f":"IF($A$43='HCFV TCO Dashboard'!$C$15,'HCFV TCO Dashboard'!F23,)","v":0}]
["USD",{"$f":"IF($A$44='HCFV TCO Dashboard'!$C$15,'HCFV TCO Dashboard'!C23*Currency!$C$5,)","v":0},{"$f":"IF($A$44='HCFV TCO Dashboard'!$C$15,'HCFV TCO Dashboard'!D23*Currency!$C$5,)","v":0},{"$f":"IF($A$44='HCFV TCO Dashboard'!$C$15,'HCFV TCO Dashboard'!E23*Currency!$C$5,)","v":0},{"$f":"IF($A$44='HCFV TCO Dashboard'!$C$15,'HCFV TCO Dashboard'!F23*Currency!$C$5,)","v":0}]
["EURO",{"$f":"IF($A$45='HCFV TCO Dashboard'!$C$15,'HCFV TCO Dashboard'!C23*Currency!$C$8,)","v":0},{"$f":"IF($A$45='HCFV TCO Dashboard'!$C$15,'HCFV TCO Dashboard'!D23*Currency!$C$8,)","v":0},{"$f":"IF($A$45='HCFV TCO Dashboard'!$C$15,'HCFV TCO Dashboard'!E23*Currency!$C$8,)","v":0},{"$f":"IF($A$45='HCFV TCO Dashboard'!$C$15,'HCFV TCO Dashboard'!F23*Currency!$C$8,)","v":0}]

{"sheet":"Operational Cost","index":5,"n_rows":47,"n_cols":5,"rows_kept":47,"cut":false,"hidden":true,"merged":[[33,0,33,4],[38,0,38,4],[43,0,43,4]]}
["Staff cost","e-HCFV (LT)","e-HCFV (HT)","D-HCFV (LT)","D-HCFV (HT)"]
["Staff Cost (₹ / Month)",{"$f":"'HCFV TCO Dashboard'!C39","v":50000},{"$f":"'HCFV TCO Dashboard'!C39","v":50000},{"$f":"'HCFV TCO Dashboard'!C39","v":50000},{"$f":"'HCFV TCO Dashboard'!C39","v":50000}]
["Other Support staff cost (₹ / Month)",0,0,0,0]
["Total Annual Staff Cost (₹)",{"$f":"((B2+B3)*12)","v":600000},{"$f":"((C2+C3)*12)","v":600000},600000,600000]
["Per km Staff Cost",{"$f":"B4/Summary!$B$4","v":6.3492063492063489},{"$f":"C4/Summary!$B$4","v":6.3492063492063489},{"$f":"D4/Summary!$B$4","v":6.3492063492063489},{"$f":"E4/Summary!$B$4","v":6.3492063492063489}]
[]
["Average Fuel Cost","e-HCFV (LT)","e-HCFV (HT)","D-HCFV (LT)","D-HCFV (HT)"]
["Fuel cost (₹/kWh; ₹/L)",{"$f":"VLOOKUP('HCFV TCO Dashboard'!$C$15,'Operational Cost'!$A$45:$E$47,2,0)","v":6},{"$f":"VLOOKUP('HCFV TCO Dashboard'!$C$15,'Operational Cost'!$A$45:$E$47,3,0)","v":6},{"$f":"VLOOKUP('HCFV TCO Dashboard'!$C$15,'Operational Cost'!$A$45:$E$47,4,0)","v":89},{"$f":"VLOOKUP('HCFV TCO Dashboard'!$C$15,'Operational Cost'!$A$45:$E$47,5,0)","v":89}]
["Mileage (km/kWh; km/L)",{"$f":"'HCFV TCO Dashboard'!C46","v":0.7},{"$f":"'HCFV TCO Dashboard'!D46","v":0.55000000000000004},{"$f":"'HCFV TCO Dashboard'!E46","v":3.5},{"$f":"'HCFV TCO Dashboard'!F46","v":2.5}]
["Annual fuel consumption (kWh; L)",{"$f":"Summary!B4/B9","v":135000},{"$f":"Summary!B4/C9","v":171818.18181818179},{"$f":"Summary!B4/D9","v":27000},{"$f":"Summary!$B$4/E9","v":37800}]
["Total Annual Fuel Cost ( ₹ )",{"$f":"(B10*B8)","v":810000},{"$f":"(C10*C8)","v":1030909.0909090908},{"$f":"(D10*D8)","v":2403000},{"$f":"(E10*E8)","v":3364200}]
["Per km Fuel Cost",{"$f":"B11/Summary!$B$4","v":8.5714285714285712},{"$f":"C11/Summary!$B$4","v":10.909090909090908},{"$f":"D11/Summary!$B$4","v":25.428571428571427},{"$f":"E11/Summary!$B$4","v":35.6}]
[]
["Maintenance Cost","e-HCFV (LT)","e-HCFV (HT)","D-HCFV (LT)","D-HCFV (HT)"]
["Annual Maintenance Cost (₹)",{"$f":"VLOOKUP('HCFV TCO Dashboard'!$C$15,'Operational Cost'!$A$40:$E$42,2,0)","v":30500},{"$f":"VLOOKUP('HCFV TCO Dashboard'!$C$15,'Operational Cost'!$A$40:$E$42,3,0)","v":32000},{"$f":"VLOOKUP('HCFV TCO Dashboard'!$C$15,'Operational Cost'!$A$40:$E$42,4,0)","v":61172},{"$f":"VLOOKUP('HCFV TCO Dashboard'!$C$15,'Operational Cost'!$A$40:$E$42,5,0)","v":63000}]
["Other Consumables (₹)",0,0,0,0]
["Other Misc. Cost (₹)",0,0,0,0]
["Total Annual Maintenance cost (₹)",{"$f":"(SUM(B15:B17))","v":30500},{"$f":"(SUM(C15:C17))","v":32000},{"$f":"(SUM(D15:D17))","v":61172},{"$f":"(SUM(E15:E17))","v":63000}]
["Per km Maintenance Cost",{"$f":"B18/Summary!$B$4","v":0.32275132275132273},{"$f":"C18/Summary!$B$4","v":0.33862433862433861},{"$f":"D18/Summary!$B$4","v":0.6473227513227513},{"$f":"E18/Summary!$B$4","v":0.66666666666666663}]
[]
["Battery Replacement Cost","e-HCFV (LT)","e-HCFV (HT)","D-HCFV (LT)","D-HCFV (HT)"]
["Number of  battery replacements ",{"$f":"'HCFV TCO Dashboard'!C45","v":1},{"$f":"'HCFV TCO Dashboard'!D45","v":1},0,0]
["Capacity of battery (kWh)",{"$f":"'HCFV TCO Dashboard'!C44","v":350},{"$f":"'HCFV TCO Dashboard'!D44","v":550},0,0]
["Battery Cost (₹ / kWh)",{"$f":"Summary!$B$6*Summary!$B$7","v":10001},{"$f":"Summary!$B$6*Summary!$B$7","v":10001},0,0]
["Total battery Cost (₹)",{"$f":"B24*B23","v":3500350},{"$f":"C24*C23","v":5500550},{"$f":"D24*D23","v":0},0]
["Battery replacement Charge (₹) ",{"$f":"B25*0.2","v":700070},{"$f":"C25*0.2","v":1100110},0,0]
["Total battery replacement cost (₹)",{"$f":"((B25+B26)*B22)","v":4200420},{"$f":"((C25+C26)*C22)","v":6600660},{"$f":"((D25+D26)*D22)","v":0},0]
["Annual Battery Replacement Cost",{"$f":"B27/Summary!B3","v":420042},{"$f":"C27/Summary!B3","v":660066},{"$f":"D27/Summary!B3","v":0}]
["Per Km Battery Replacement Cost",{"$f":"B27/Summary!$B$5","v":4.4448888888888884},{"$f":"C27/Summary!$B$5","v":6.9848253968253964},{"$f":"D27/Summary!$B$5","v":0},{"$f":"E27/Summary!$B$5","v":0}]
[]
["Total Operational Cost",{"$f":"B27+B18+B11+B4","v":5640920},{"$f":"C27+C18+C11+C4","v":8263569.0909090908},{"$f":"D27+D18+D11+D4","v":3064172},{"$f":"E27+E18+E11+E4","v":4027200}]
["Per Km Operational Cost",{"$f":"B29+B19+B12+B5","v":19.68827513227513},{"$f":"C29+C19+C12+C5","v":24.581746993746989},{"$f":"D29+D19+D12+D5","v":32.425100529100526},{"$f":"E29+E19+E12+E5","v":42.615873015873014}]
[]
["STAFF COST"]
["INR",{"$f":"IF($A$35='HCFV TCO Dashboard'!$C$15,'HCFV TCO Dashboard'!C39,)","v":50000}]
["USD",{"$f":"IF($A$36='HCFV TCO Dashboard'!$C$15,'HCFV TCO Dashboard'!C39*Currency!$C$5,)","v":0}]
["EURO",{"$f":"IF($A$37='HCFV TCO Dashboard'!$C$15,'HCFV TCO Dashboard'!C39*Currency!$C$8,)","v":0}]
[]
["ANNUAL MAINTENANCE COST"]
["INR",{"$f":"IF($A$40='HCFV TCO Dashboard'!$C$15,'HCFV TCO Dashboard'!C47,)","v":30500},{"$f":"IF($A$40='HCFV TCO Dashboard'!$C$15,'HCFV TCO Dashboard'!D47,)","v":32000},{"$f":"IF($A$40='HCFV TCO Dashboard'!$C$15,'HCFV TCO Dashboard'!E47,)","v":61172},{"$f":"IF($A$40='HCFV TCO Dashboard'!$C$15,'HCFV TCO Dashboard'!F47,)","v":63000}]
["USD",{"$f":"IF($A$41='HCFV TCO Dashboard'!$C$15,'HCFV TCO Dashboard'!C47*Currency!$C$5,)","v":0},{"$f":"IF($A$41='HCFV TCO Dashboard'!$C$15,'HCFV TCO Dashboard'!D47*Currency!$C$5,)","v":0},{"$f":"IF($A$41='HCFV TCO Dashboard'!$C$15,'HCFV TCO Dashboard'!E47*Currency!$C$5,)","v":0},{"$f":"IF($A$41='HCFV TCO Dashboard'!$C$15,'HCFV TCO Dashboard'!F47*Currency!$C$5,)","v":0}]
["EURO",{"$f":"IF($A$42='HCFV TCO Dashboard'!$C$15,'HCFV TCO Dashboard'!C47*Currency!$C$8,)","v":0},{"$f":"IF($A$42='HCFV TCO Dashboard'!$C$15,'HCFV TCO Dashboard'!D47*Currency!$C$8,)","v":0},{"$f":"IF($A$42='HCFV TCO Dashboard'!$C$15,'HCFV TCO Dashboard'!E47*Currency!$C$8,)","v":0},{"$f":"IF($A$42='HCFV TCO Dashboard'!$C$15,'HCFV TCO Dashboard'!F47*Currency!$C$8,)","v":0}]
[]
["AVERAGE FUEL COST"]
["INR",{"$f":"IF($A$45='HCFV TCO Dashboard'!$C$15,'HCFV TCO Dashboard'!C43,)","v":6},{"$f":"IF($A$45='HCFV TCO Dashboard'!$C$15,'HCFV TCO Dashboard'!D43,)","v":6},{"$f":"IF($A$45='HCFV TCO Dashboard'!$C$15,'HCFV TCO Dashboard'!E43,)","v":89},{"$f":"IF($A$45='HCFV TCO Dashboard'!$C$15,'HCFV TCO Dashboard'!F43,)","v":89}]
["USD",{"$f":"IF($A$46='HCFV TCO Dashboard'!$C$15,'HCFV TCO Dashboard'!C43*Currency!$C$5,)","v":0},{"$f":"IF($A$46='HCFV TCO Dashboard'!$C$15,'HCFV TCO Dashboard'!$D$43*Currency!$C$5/3.78,)","v":0},{"$f":"IF($A$46='HCFV TCO Dashboard'!$C$15,'HCFV TCO Dashboard'!E43*Currency!$C$5/3.78,)","v":0},{"$f":"IF($A$46='HCFV TCO Dashboard'!$C$15,'HCFV TCO Dashboard'!F43*Currency!$C$5/2.567,)","v":0}]
["EURO",{"$f":"IF($A$47='HCFV TCO Dashboard'!$C$15,'HCFV TCO Dashboard'!C43*Currency!$C$8,)","v":0},{"$f":"IF($A$47='HCFV TCO Dashboard'!$C$15,'HCFV TCO Dashboard'!D43*Currency!$C$8,)","v":0},{"$f":"IF($A$47='HCFV TCO Dashboard'!$C$15,'HCFV TCO Dashboard'!E43*Currency!$C$8,)","v":0},{"$f":"IF($A$47='HCFV TCO Dashboard'!$C$15,'HCFV TCO Dashboard'!F43*Currency!$C$8,)","v":0}]

{"sheet":"Financing","index":6,"n_rows":24,"n_cols":5,"rows_kept":24,"cut":false,"hidden":true,"merged":[[20,0,20,4],[25,0,25,4]]}
["Vehicle Cost","e-HCFV (LT)","e-HCFV (HT)","D-HCFV (LT)","D-HCFV (HT)"]
["Total Cost of HCFV (₹)",{"$f":"'HCFV TCO Dashboard'!C20-'HCFV TCO Dashboard'!C23","v":7000000},{"$f":"'HCFV TCO Dashboard'!D20","v":11050000},{"$f":"'HCFV TCO Dashboard'!E20","v":3370000},{"$f":"'HCFV TCO Dashboard'!F20","v":3941000}]
["Share of Operator (%)",{"$f":"100%-B6","v":0.8},{"$f":"100%-C6","v":0.8},0.8,0.8]
["Share of Operator (₹)",{"$f":"B3*B2","v":5600000},{"$f":"C3*C2","v":8840000},{"$f":"D3*D2","v":2696000},{"$f":"E3*E2","v":3152800}]
["Processing  Fees",{"$f":"IF(B8=0,0,IF(B4*0.5%>500,B4*0.5%,500))","v":28000},{"$f":"IF(C8=0,0,IF(C4*0.5%>500,C4*0.5%,500))","v":44200},13480,15764]
["Equity %",{"$f":"'HCFV TCO Dashboard'!C31","v":0.2},{"$f":"'HCFV TCO Dashboard'!D31","v":0.2},{"$f":"'HCFV TCO Dashboard'!E31","v":0.2},{"$f":"'HCFV TCO Dashboard'!F31","v":0.2}]
["Equity (₹)",{"$f":"(B6*B2)","v":1400000},{"$f":"(C6*C2)","v":2210000},{"$f":"(D6*D2)","v":674000},{"$f":"(E6*E2)","v":788200}]
["Loan amount (₹)",{"$f":"B4","v":5600000},{"$f":"C4","v":8840000},{"$f":"D4","v":2696000},{"$f":"E4","v":3152800}]
["Interest rate (%)",{"$f":"'HCFV TCO Dashboard'!C30","v":0.08},{"$f":"'HCFV TCO Dashboard'!D30","v":0.08},{"$f":"'HCFV TCO Dashboard'!E30","v":0.11},{"$f":"'HCFV TCO Dashboard'!F30","v":0.11}]
["Term of payment (yrs)",{"$f":"'HCFV TCO Dashboard'!C29","v":7},{"$f":"'HCFV TCO Dashboard'!D29","v":7},{"$f":"'HCFV TCO Dashboard'!E29","v":7},{"$f":"'HCFV TCO Dashboard'!F29","v":7}]
["No of EMI (Yearly)",{"$f":"B10*12","v":84},{"$f":"C10*12","v":84},84,84]
["Monthly EMI Loan (Rs.)",{"$f":"((PMT(B9/12,B10*12,-B8))+(B5/B11))","v":87616.13398828276},{"$f":"((PMT(C9/12,C10*12,-C8))+(C5/C11))","v":138308.32579578922},46322.564818963241,54171.284258615473]
["Total interest paid",{"$f":"(B12*B10*12)-B8","v":1759755.2550157513},{"$f":"(C12*C10*12)-C8","v":2777899.3668462932},1195095.4447929123,1397587.8777236994]
["Yearly Interest Paid",{"$f":"B13/B10","v":251393.60785939306},{"$f":"C13/C10","v":396842.76669232763},{"$f":"D13/D10","v":170727.92068470176},{"$f":"E13/E10","v":199655.41110338565}]
["EMI per KM (Rs.)",{"$f":"B14/Summary!B4","v":2.660249818617916},{"$f":"C14/Summary!B4","v":4.1993943565325678},{"$f":"D14/Summary!B4","v":1.8066446633301774},{"$f":"E14/Summary!B4","v":2.1127556730517001}]
[]
["Total Interest Paid",{"$f":"VLOOKUP('HCFV TCO Dashboard'!$C$15,Financing!$A$22:$E$24,2,0)","v":1759755.2550157513},{"$f":"VLOOKUP('HCFV TCO Dashboard'!$C$15,Financing!$A$22:$E$24,3,0)","v":2777899.3668462932},{"$f":"VLOOKUP('HCFV TCO Dashboard'!$C$15,Financing!$A$22:$E$24,4,0)","v":1195095.4447929123},{"$f":"VLOOKUP('HCFV TCO Dashboard'!$C$15,Financing!$A$22:$E$24,5,0)","v":1397587.8777236994}]
["(Used for Dashboard Calc.)"]
[]
[]
["YEARLY INTEREST"]
["INR",{"$f":"IF($A$22='HCFV TCO Dashboard'!$C$15,Financing!B13,)","v":1759755.2550157513},{"$f":"IF($A$22='HCFV TCO Dashboard'!$C$15,Financing!C13,)","v":2777899.3668462932},{"$f":"IF($A$22='HCFV TCO Dashboard'!$C$15,Financing!D13,)","v":1195095.4447929123},{"$f":"IF($A$22='HCFV TCO Dashboard'!$C$15,Financing!E13,)","v":1397587.8777236994}]
["USD",{"$f":"IF($A$23='HCFV TCO Dashboard'!$C$15,Financing!B13*Currency!$C$5,)","v":0},{"$f":"IF($A$23='HCFV TCO Dashboard'!$C$15,Financing!C13*Currency!$C$5,)","v":0},{"$f":"IF($A$23='HCFV TCO Dashboard'!$C$15,Financing!D13*Currency!$C$5,)","v":0},{"$f":"IF($A$23='HCFV TCO Dashboard'!$C$15,Financing!E13*Currency!$C$5,)","v":0}]
["EURO",{"$f":"IF($A$24='HCFV TCO Dashboard'!$C$15,Financing!B13*Currency!$C$8,)","v":0},{"$f":"IF($A$24='HCFV TCO Dashboard'!$C$15,Financing!C13*Currency!$C$8,)","v":0},{"$f":"IF($A$24='HCFV TCO Dashboard'!$C$15,Financing!D13*Currency!$C$8,)","v":0},{"$f":"IF($A$24='HCFV TCO Dashboard'!$C$15,Financing!E13*Currency!$C$8,)","v":0}]

{"sheet":"TCO_1","index":7,"n_rows":40,"n_cols":13,"rows_kept":40,"cut":false,"hidden":true,"merged":[]}
["Parameter","Unit","e-HCFV (LT)","e-HCFV (HT)","D-HCFV (LT)","D-HCFV (HT)"]
["Discount rate value","-",{"$f":"Summary!B9","v":0.1},{"$f":"Summary!C9","v":0.1},{"$f":"Summary!D9","v":0.1},{"$f":"Summary!E9","v":0.1}]
["Resale rate value","-",{"$f":"Summary!B10","v":0.2},{"$f":"Summary!C10","v":0.2},{"$f":"Summary!D10","v":0.1},{"$f":"Summary!E10","v":0.1}]
["Capital recovery factor (CRF)_N","-",{"$f":"C2*(1+C2)^Summary!B3","v":0.2593742460100002},{"$f":"D2*(1+D2)^Summary!B3","v":0.2593742460100002},{"$f":"E2*(1+E2)^Summary!B3","v":0.2593742460100002},{"$f":"F2*(1+F2)^Summary!B3","v":0.2593742460100002}]
["Capital recovery factor (CRF)_D","-",{"$f":"((1+C2)^Summary!B3)-1","v":1.5937424601000019},{"$f":"(1+D2)^Summary!B3-1","v":1.5937424601000019},{"$f":"(1+E2)^Summary!B3-1","v":1.5937424601000019},{"$f":"(1+F2)^Summary!B3-1","v":1.5937424601000019}]
["CRF","-",{"$f":"C4/C5","v":0.16274539488251155},{"$f":"D4/D5","v":0.16274539488251155},{"$f":"E4/E5","v":0.16274539488251155},{"$f":"F4/F5","v":0.16274539488251155}]
["Present value factor (PVF)","-",{"$f":"1/(1+C2)^10","v":0.38554328942953148},{"$f":"1/(1+D2)^Summary!B3","v":0.38554328942953148},{"$f":"1/(1+E2)^Summary!B3","v":0.38554328942953148},{"$f":"1/(1+F2)^Summary!B3","v":0.38554328942953148}]
["Residual value (RV)","₹",{"$f":"Summary!B13*C3","v":1765361.0510031504},{"$f":"Summary!C13*D3","v":2785289.8733692588},{"$f":"Summary!D13*E3","v":465720.74447929126},{"$f":"Summary!E13*F3","v":543538.18777236994}]
["Annual  Travel Distance","km",{"$f":"Summary!$B$4","v":94500},{"$f":"Summary!$B$4","v":94500},{"$f":"Summary!$B$4","v":94500},{"$f":"Summary!$B$4","v":94500}]
["Capex component","₹",{"$f":"((Summary!B18-(C8*C7))*C6)","v":1851584.0013885631},{"$f":"(Summary!C18-(D8*D7))*D6","v":3116997.376311711},{"$f":"(Summary!D18-(E8*E7))*E6","v":728717.23263526475},{"$f":"(Summary!E18-(F8*F7))*F6","v":850478.85180188855}]
["TCO","₹/km",{"$f":"(C10+L22)/C9","v":31.691074270759394},{"$f":"(D10+L23)/D9","v":48.088518618083015},{"$f":"(E10+L24)/E9","v":27.635114078067698},{"$f":"(F10+L25)/F9","v":35.185385360965903}]
[]
["Opex / year"]
["Vehicle type","Unit",1,{"$f":"C14+1","v":2},3,4,5,6,7,8,9,10,"Total"]
["e-HCFV (LT)","₹",{"$f":"Summary!$B$26/(1+$C$2)^C14","v":1691401.8181818181},{"$f":"Summary!$B$26/(1+$C$2)^D14","v":1537638.0165289254},{"$f":"Summary!$B$26/(1+$C$2)^E14","v":1397852.7422990229},{"$f":"Summary!$B$26/(1+$C$2)^F14","v":1270775.2202718391},{"$f":"Summary!$B$26/(1+$C$2)^G14","v":1155250.2002471264},{"$f":"Summary!$B$26/(1+$C$2)^H14","v":1050227.4547701147},{"$f":"Summary!$B$26/(1+$C$2)^I14","v":954752.23160919501},{"$f":"Summary!$B$26/(1+$C$2)^J14","v":867956.57419017737},{"$f":"Summary!$B$26/(1+$C$2)^K14","v":789051.4310819793},{"$f":"Summary!$B$26/(1+$C$2)^L14","v":717319.48280179931},{"$f":"SUM(C15:L15)/Summary!B3","v":1143222.5171981996}]
["e-HCFV (HT)","₹",{"$f":"Summary!$C$26/(1+$D$2)^C14","v":2111795.5371900825},{"$f":"Summary!$C$26/(1+$D$2)^D14","v":1919814.1247182565},{"$f":"Summary!$C$26/(1+$D$2)^E14","v":1745285.5679256876},{"$f":"Summary!$C$26/(1+$D$2)^F14","v":1586623.2435688069},{"$f":"Summary!$C$26/(1+$D$2)^G14","v":1442384.7668807334},{"$f":"Summary!$C$26/(1+$D$2)^H14","v":1311258.8789824848},{"$f":"Summary!$C$26/(1+$D$2)^I14","v":1192053.5263477133},{"$f":"Summary!$C$26/(1+$D$2)^J14","v":1083685.0239524667},{"$f":"Summary!$C$26/(1+$D$2)^K14","v":985168.20359315141},{"$f":"Summary!$C$26/(1+$D$2)^L14","v":895607.45781195583},{"$f":"SUM(C16:L16)/Summary!B3","v":1427367.6330971341}]
["D-HCFV (LT)","₹",{"$f":"Summary!$D$26/(1+$E$2)^C14","v":2785610.9090909087},{"$f":"Summary!$D$26/(1+$E$2)^D14","v":2532373.5537190079},{"$f":"Summary!$D$26/(1+$E$2)^E14","v":2302157.7761081886},{"$f":"Summary!$D$26/(1+$E$2)^F14","v":2092870.7055528988},{"$f":"Summary!$D$26/(1+$E$2)^G14","v":1902609.732320817},{"$f":"Summary!$D$26/(1+$E$2)^H14","v":1729645.2112007425},{"$f":"Summary!$D$26/(1+$E$2)^I14","v":1572404.7374552202},{"$f":"Summary!$D$26/(1+$E$2)^J14","v":1429458.8522320185},{"$f":"Summary!$D$26/(1+$E$2)^K14","v":1299508.0474836531},{"$f":"Summary!$D$26/(1+$E$2)^L14","v":1181370.9522578663},{"$f":"SUM(C17:L17)/Summary!B3","v":1882801.0477421326}]
["D-HCFV (HT)","₹",{"$f":"Summary!$E$26/(1+$F$2)^C14","v":3661090.9090909087},{"$f":"Summary!$E$26/(1+$F$2)^D14","v":3328264.4628099171},{"$f":"Summary!$E$26/(1+$F$2)^E14","v":3025694.9661908331},{"$f":"Summary!$E$26/(1+$F$2)^F14","v":2750631.787446212},{"$f":"Summary!$E$26/(1+$F$2)^G14","v":2500574.3522238289},{"$f":"Summary!$E$26/(1+$F$2)^H14","v":2273249.4111125716},{"$f":"Summary!$E$26/(1+$F$2)^I14","v":2066590.373738701},{"$f":"Summary!$E$26/(1+$F$2)^J14","v":1878718.5215806374},{"$f":"Summary!$E$26/(1+$F$2)^K14","v":1707925.9287096702},{"$f":"Summary!$E$26/(1+$F$2)^L14","v":1552659.9351906092},{"$f":"SUM(C18:L18)/Summary!B3","v":2474540.0648093889}]
[]
["Opex Sum"]
["Vehicle type","Unit",1,{"$f":"C21+1","v":2},3,4,5,6,7,8,9,10]
["e-HCFV (LT)","₹/km",{"$f":"(1/C21)*SUM($C$15:C15)","v":1691401.8181818181},{"$f":"(1/D21)*SUM($C$15:D15)","v":1614519.9173553716},{"$f":"(1/E21)*SUM($C$15:E15)","v":1542297.5256699221},{"$f":"(1/F21)*SUM($C$15:F15)","v":1474416.9493204013},{"$f":"(1/G21)*SUM($C$15:G15)","v":1410583.5995057465},{"$f":"(1/H21)*SUM($C$15:H15)","v":1350524.2420498077},{"$f":"(1/I21)*SUM($C$15:I15)","v":1293985.3834154345},{"$f":"(1/J21)*SUM($C$15:J15)","v":1240731.7822622773},{"$f":"(1/K21)*SUM($C$15:K15)","v":1190545.0765755775},{"$f":"(1/L21)*SUM($C$15:L15)","v":1143222.5171981996}]
["e-HCFV (HT)","₹/km",{"$f":"(1/C21)*SUM($C$16:C16)","v":2111795.5371900825},{"$f":"(1/D21)*SUM($C$16:D16)","v":2015804.8309541694},{"$f":"(1/E21)*SUM($C$16:E16)","v":1925631.7432780089},{"$f":"(1/F21)*SUM($C$16:F16)","v":1840879.6183507084},{"$f":"(1/G21)*SUM($C$16:G16)","v":1761180.6480567136},{"$f":"(1/H21)*SUM($C$16:H16)","v":1686193.686544342},{"$f":"(1/I21)*SUM($C$16:I16)","v":1615602.2350876806},{"$f":"(1/J21)*SUM($C$16:J16)","v":1549112.5836957791},{"$f":"(1/K21)*SUM($C$16:K16)","v":1486452.0970177094},{"$f":"(1/L21)*SUM($C$16:L16)","v":1427367.6330971341}]
["D-HCFV (LT)","₹/km",{"$f":"(1/C21)*SUM($C$17:C17)","v":2785610.9090909087},{"$f":"(1/D21)*SUM($C$17:D17)","v":2658992.2314049583},{"$f":"(1/E21)*SUM($C$17:E17)","v":2540047.4129727017},{"$f":"(1/F21)*SUM($C$17:F17)","v":2428253.2361177509},{"$f":"(1/G21)*SUM($C$17:G17)","v":2323124.5353583642},{"$f":"(1/H21)*SUM($C$17:H17)","v":2224211.314665427},{"$f":"(1/I21)*SUM($C$17:I17)","v":2131096.0893496834},{"$f":"(1/J21)*SUM($C$17:J17)","v":2043391.4347099753},{"$f":"(1/K21)*SUM($C$17:K17)","v":1960737.7250181618},{"$f":"(1/L21)*SUM($C$17:L17)","v":1882801.0477421326}]
["D-HCFV (HT)","₹/km",{"$f":"(1/C21)*SUM($C$18:C18)","v":3661090.9090909087},{"$f":"(1/D21)*SUM($C$18:D18)","v":3494677.6859504129},{"$f":"(1/E21)*SUM($C$18:E18)","v":3338350.1126972195},{"$f":"(1/F21)*SUM($C$18:F18)","v":3191420.5313844676},{"$f":"(1/G21)*SUM($C$18:G18)","v":3053251.2955523399},{"$f":"(1/H21)*SUM($C$18:H18)","v":2923250.981479045},{"$f":"(1/I21)*SUM($C$18:I18)","v":2800870.8946589958},{"$f":"(1/J21)*SUM($C$18:J18)","v":2685601.8480242011},{"$f":"(1/K21)*SUM($C$18:K18)","v":2576971.1903225863},{"$f":"(1/L21)*SUM($C$18:L18)","v":2474540.0648093889}]
[]
["TCO / year"]
["Vehicle type","Unit",1,{"$f":"C28+1","v":2},3,4,5,6,7,8,9,10,"Average TCO"]
["PVF","-",{"$f":"1/(1+$C$2)^C28","v":0.90909090909090906},{"$f":"1/(1+$C$2)^D28","v":0.82644628099173545},0.75131480090157754,0.68301345536507052,0.62092132305915493,0.56447393005377722,0.51315811823070645,0.46650738020973315,0.42409761837248466,0.38554328942953148]
["CRF","-",{"$f":"($C$2*(1+$C$2)^C28)/((1+$C$2)^C28-1)","v":1.0999999999999992},{"$f":"($C$2*(1+$C$2)^D28)/((1+$C$2)^D28-1)","v":0.57619047619047581},0.40211480362537733,0.31547080370609765,0.26379748079474524,0.22960738036266726,0.20540549970059557,0.18744401757481335,0.1736405390743434,0.16274539488251155]
["e-HCFV (LT)","₹/km",{"$f":"(((Summary!$B$18-($C$8*C29))*C30)+C22)/($C$9)","v":139.57276770048662},{"$f":"(((Summary!$B$18-($C$8*D29))*D30)+D22)/($C$9)","v":81.708617455339791},{"$f":"(((Summary!$B$18-($C$8*E29))*E30)+E22)/($C$9)","v":61.984950377692243},{"$f":"(((Summary!$B$18-($C$8*F29))*F30)+F22)/($C$9)","v":51.829827508579243},{"$f":"(((Summary!$B$18-($C$8*G29))*G30)+G22)/($C$9)","v":45.526355098889546},{"$f":"(((Summary!$B$18-($C$8*H29))*H30)+H22)/($C$9)","v":41.166999982670625},{"$f":"(((Summary!$B$18-($C$8*I29))*I30)+I22)/($C$9)","v":37.932763316205893},{"$f":"(((Summary!$B$18-($C$8*J29))*J30)+J22)/($C$9)","v":35.412962747379012},{"$f":"(((Summary!$B$18-($C$8*K29))*K30)+K22)/($C$9)","v":33.378484038658648},{"$f":"(((Summary!$B$18-($C$8*L29))*L30)+L22)/($C$9)","v":31.691074270759394},{"$f":"SUM(C31:L31)/$L$28","v":56.020480249666107}]
["PVF","-",{"$f":"1/(1+$D$2)^C28","v":0.90909090909090906},{"$f":"1/(1+$D$2)^D28","v":0.82644628099173545},0.75131480090157754,0.68301345536507052,0.62092132305915493,0.56447393005377722,0.51315811823070645,0.46650738020973315,0.42409761837248466,0.38554328942953148]
["CRF","-",{"$f":"($D$2*(1+$D$2)^C28)/((1+$D$2)^C28-1)","v":1.0999999999999992},{"$f":"($D$2*(1+$D$2)^D28)/((1+$D$2)^D28-1)","v":0.57619047619047581},0.40211480362537733,0.31547080370609765,0.26379748079474524,0.22960738036266726,0.20540549970059557,0.18744401757481335,0.1736405390743434,0.16274539488251155]
["e-HCFV (HT)","₹/km",{"$f":"(((Summary!$C$18-($D$8*C32))*C33)+C23)/($D$9)","v":228.31322716774324},{"$f":"(((Summary!$C$18-($D$8*D32))*D33)+D23)/($D$9)","v":130.62183928202819},{"$f":"(((Summary!$C$18-($D$8*E32))*E33)+E23)/($D$9)","v":97.539779421516783},{"$f":"(((Summary!$C$18-($D$8*F32))*F33)+F23)/($D$9)","v":80.651695329746758},{"$f":"(((Summary!$C$18-($D$8*G32))*G33)+G23)/($D$9)","v":70.271360549335839},{"$f":"(((Summary!$C$18-($D$8*H32))*H33)+H23)/($D$9)","v":63.167636144613688},{"$f":"(((Summary!$C$18-($D$8*I32))*I33)+I23)/($D$9)","v":57.953876227936966},{"$f":"(((Summary!$C$18-($D$8*J32))*J33)+J23)/($D$9)","v":53.93526537199088},{"$f":"(((Summary!$C$18-($D$8*K32))*K33)+K23)/($D$9)","v":50.724586464376607},{"$f":"(((Summary!$C$18-($D$8*L32))*L33)+L23)/($D$9)","v":48.088518618083015},{"$f":"SUM(C34:L34)/$L$28","v":88.126778457737174}]
["PVF","-",{"$f":"1/(1+$E$2)^C28","v":0.90909090909090906},{"$f":"1/(1+$E$2)^D28","v":0.82644628099173545},0.75131480090157754,0.68301345536507052,0.62092132305915493,0.56447393005377722,0.51315811823070645,0.46650738020973315,0.42409761837248466,0.38554328942953148]
["CRF","-",{"$f":"($E$2*(1+$E$2)^C28)/((1+$E$2)^C28-1)","v":1.0999999999999992},{"$f":"($E$2*(1+$E$2)^D28)/((1+$E$2)^D28-1)","v":0.57619047619047581},0.40211480362537733,0.31547080370609765,0.26379748079474524,0.22960738036266726,0.20540549970059557,0.18744401757481335,0.1736405390743434,0.16274539488251155]
["D-HCFV (LT)","₹/km",{"$f":"(((Summary!$D$18-($E$8*C35))*C36)+C24)/($E$9)","v":78.759982580781141},{"$f":"(((Summary!$D$18-($E$8*D35))*D36)+D24)/($E$9)","v":54.186867975160204},{"$f":"(((Summary!$D$18-($E$8*E35))*E36)+E24)/($E$9)","v":45.20717818852512},{"$f":"(((Summary!$D$18-($E$8*F35))*F36)+F24)/($E$9)","v":40.181132154889283},{"$f":"(((Summary!$D$18-($E$8*G35))*G36)+G24)/($E$9)","v":36.776722138981015},{"$f":"(((Summary!$D$18-($E$8*H35))*H36)+H24)/($E$9)","v":34.213541483569593},{"$f":"(((Summary!$D$18-($E$8*I35))*I36)+I24)/($E$9)","v":32.154736338242671},{"$f":"(((Summary!$D$18-($E$8*J35))*J36)+J24)/($E$9)","v":30.429974771175523},{"$f":"(((Summary!$D$18-($E$8*K35))*K36)+K24)/($E$9)","v":28.94308793260835},{"$f":"(((Summary!$D$18-($E$8*L35))*L36)+L24)/($E$9)","v":27.635114078067698},{"$f":"SUM(C37:L37)/$L$28","v":40.848833764200066}]
["PVF","-",{"$f":"1/(1+$F$2)^C28","v":0.90909090909090906},{"$f":"1/(1+$F$2)^D28","v":0.82644628099173545},0.75131480090157754,0.68301345536507052,0.62092132305915493,0.56447393005377722,0.51315811823070645,0.46650738020973315,0.42409761837248466,0.38554328942953148]
["CRF","-",{"$f":"($F$2*(1+$F$2)^C28)/((1+$F$2)^C28-1)","v":1.0999999999999992},{"$f":"($F$2*(1+$F$2)^D28)/((1+$F$2)^D28-1)","v":0.57619047619047581},0.40211480362537733,0.31547080370609765,0.26379748079474524,0.22960738036266726,0.20540549970059557,0.18744401757481335,0.1736405390743434,0.16274539488251155]
["D-HCFV (HT)","₹/km",{"$f":"(((Summary!$E$18-($F$8*C38))*C39)+C25)/($F$9)","v":96.25897128904343},{"$f":"(((Summary!$E$18-($F$8*D38))*D39)+D25)/($F$9)","v":67.382701057037892},{"$f":"(((Summary!$E$18-($F$8*E38))*E39)+E25)/($F$9)","v":56.717319536775406},{"$f":"(((Summary!$E$18-($F$8*F38))*F39)+F25)/($F$9)","v":50.677335562277811},{"$f":"(((Summary!$E$18-($F$8*G38))*G39)+G25)/($F$9)","v":46.540329695030778},{"$f":"(((Summary!$E$18-($F$8*H38))*H39)+H25)/($F$9)","v":43.39479592645133},{"$f":"(((Summary!$E$18-($F$8*I38))*I39)+I25)/($F$9)","v":40.84694509024223},{"$f":"(((Summary!$E$18-($F$8*J38))*J39)+J25)/($F$9)","v":38.69738096713138},{"$f":"(((Summary!$E$18-($F$8*K38))*K39)+K25)/($F$9)","v":36.83330565598304},{"$f":"(((Summary!$E$18-($F$8*L38))*L39)+L25)/($F$9)","v":35.185385360965903},{"$f":"SUM(C40:L40)/$L$28","v":51.253447014093922}]