{"text_format":"1","workbook":"xlsx","n_sheets":8,"sheets":["Instructions","HCFV TCO Dashboard","Summary","Currency","Capital Cost","Operational Cost","Financing","TCO_1"],"not_rendered":{"charts":6,"images":10,"macros":0,"external_links":1,"defined_names":0,"comments":0,"pivot_tables":0},"unopened":[],"bounds":{"document_bytes":16777216,"sheet_cells":100000,"rows_first":2000,"rows_last":500,"rows_between":2000,"halvings":0,"cell_chars":16384,"cell_head_chars":4096},"cells_cut":0,"cells_raw":0,"read":"whole","date_system":"1900"}

{"sheet":"Instructions","index":0,"n_rows":43,"n_cols":6,"rows_kept":43,"cut":false,"hidden":false,"merged":[[42,1,43,14],[29,1,29,3],[17,1,17,3],[18,1,18,3],[24,1,24,3],[25,1,25,3],[26,1,26,3],[18,5,18,13],[24,5,24,13],[25,5,25,13],[36,5,36,13],[32,1,32,3],[36,1,36,3],[28,1,28,13],[19,1,19,3],[19,5,19,13],[9,1,9,3],[10,1,10,3],[9,5,9,13],[8,5,8,13],[10,5,10,13],[8,1,8,3],[14,1,14,13],[15,1,15,3],[16,1,16,3],[11,1,11,3],[1,1,1,13],[3,1,3,13],[26,5,26,13],[29,5,29,13],[12,1,12,3],[11,5,13,13],[15,5,15,13],[16,5,16,13],[17,5,17,13],[20,1,20,3],[20,5,20,13],[21,1,21,3],[21,5,21,13],[5,1,5,8],[35,1,35,3],[35,5,35,13],[22,1,22,13],[33,1,33,3],[33,5,33,13],[34,1,34,3],[34,5,34,13],[23,1,23,3],[23,5,23,13],[30,1,30,3],[30,5,30,13],[31,1,31,3],[31,5,31,13],[32,5,32,13],[27,1,27,3],[27,5,27,13]]}
[]
[null,"HOW TO USE THE DYNAMIC TOTAL COST OF OWNERSHIP DASHBOARD"]
[]
[null,"All cells highlighted Green are Input cells. Values can only be edited in these cells to observe the dynamic changes in the dashboard on the right."]
[]
[null,"All cells highlighted Gray are Fixed cells. These values cannot be edited."]
[]
[]
[null,"CELL NAME",null,null,"FUNCTION","ACTION REQUIRED"]
[null,"Vehicle Holding Period (Year)",null,null,"Editable","Use the drop down menu on Cell C5 to choose the Vehicle holding period from 1 to 10 years "]
[null,"Daily Distance Travelled (km)",null,null,"Editable","Use the arrows on the right to increase/decrease to input Daily Distance Travelled in km"]
[null,"Daily Distance Travelled (mi)",null,null,"Fixed"]
[null,"Annual Distance Travelled (km)",null,null,"Fixed"]
[null,"Annual Distance Travelled (mi)",null,null,"Fixed"]
[]
{"$rows_left_out":29}
{"sheet":"HCFV TCO Dashboard","index":1,"n_rows":61,"n_cols":48,"rows_kept":61,"cut":false,"hidden":false,"merged":[[2,1,2,3],[14,3,14,5],[16,2,16,5],[4,3,4,5]]}
[null,null,null,null,null,null,null,null,null,null,null,null,null,null,null,null,null,null,null,null,null,null,null,null,null,null,null,null,null,null,null,null,null,null,null,null,"10 YEAR","TCO",null,null,null,null,null,"DYNAMIC","TCO"]
[null,null,null,null,null,null,null,null,null,null,null,null,null,null,null,null,null,null,null,null,null,null,null,null,null,null,null,null,null,null,null,null,null,null,null,null,"e-HCFV (LT)",{"$f":"TCO_1!C11","v":31.691074270759394},null,null,null,null,null,"e-HCFV (LT)",{"$f":"VLOOKUP($C$5,$AR$10:$AV$20,2,0)","v":45.526355098889546}]
[null,null,null,null,null,null,null,null,null,null,null,null,null,null,null,null,null,null,null,null,null,null,null,null,null,null,null,null,null,null,null,null,null,null,null,null,"e-HCFV (HT)",{"$f":"TCO_1!D11","v":48.088518618083015},null,null,null,null,null,"e-HCFV (HT)",{"$f":"VLOOKUP($C$5,$AR$10:$AV$20,3,0)","v":70.271360549335839}]
[null,null,null,null,null,null,null,null,null,null,null,null,null,null,null,null,null,null,null,null,null,null,null,null,null,null,null,null,null,null,null,null,null,null,null,null,"D-HCFV (LT)",{"$f":"TCO_1!E11","v":27.635114078067698},null,null,null,null,null,"D-HCFV (LT)",{"$f":"VLOOKUP($C$5,$AR$10:$AV$20,4,0)","v":36.776722138981015}]
[null,"Vehicle Holding Period (Year)",5,"              Use Drop down to choose Holding Period",null,null,null,null,null,null,null,null,null,null,null,null,null,null,null,null,null,null,null,null,null,null,null,null,null,null,null,null,null,null,null,null,"D-HCFV (HT)",{"$f":"TCO_1!F11","v":35.185385360965903},null,null,null,null,null,"D-HCFV (HT)",{"$f":"VLOOKUP($C$5,$AR$10:$AV$20,5,0)","v":46.540329695030778}]
[]
[null,"Daily Distance Travelled (km)",300,null,"(Use Arrows to input Distance)"]
[null,"Daily Distance Travelled (mi)",{"$f":"C7*0.621371","v":186.41130000000001}]
[]
[null,"Annual Distance Travelled (km)",{"$f":"C7*315","v":94500},null,null,null,null,null,null,null,null,null,null,null,null,null,null,null,null,null,null,null,null,null,null,null,null,null,null,null,null,null,null,null,null,null,"Operational Years","e-HCFV (LT)","e-HCFV (HT)","D-HCFV (LT)","D-HCFV (HT)",null,null,null,"e-HCFV (LT)","e-HCFV (HT)","D-HCFV (LT)","D-HCFV (HT)"]
[null,"Annual Distance Travelled (mi)",{"$f":"C8*315","v":58719.559500000003},null,null,null,null,null,null,null,null,null,null,null,null,null,null,null,null,null,null,null,null,null,null,null,null,null,null,null,null,null,null,null,null,null,"Year 1",{"$f":"TCO_1!C31","v":139.57276770048662},{"$f":"TCO_1!C34","v":228.31322716774324},{"$f":"TCO_1!C37","v":78.759982580781141},{"$f":"TCO_1!C40","v":96.25897128904343},null,null,1,{"$f":"IF($C$5=AR11,AL11:AO11,)","v":0}]
[null,null,null,null,null,null,null,null,null,null,null,null,null,null,null,null,null,null,null,null,null,null,null,null,null,null,null,null,null,null,null,null,null,null,null,null,"Year 2",{"$f":"TCO_1!D31","v":81.708617455339791},{"$f":"TCO_1!D34","v":130.62183928202819},{"$f":"TCO_1!D37","v":54.186867975160204},{"$f":"TCO_1!D40","v":67.382701057037892},null,null,2,{"$f":"IF($C$5=AR12,AL12:AO12,)","v":0}]
[null,null,null,null,null,null,null,null,null,null,null,null,null,null,null,null,null,null,null,null,null,null,null,null,null,null,null,null,null,null,null,null,null,null,null,null,"Year 3",{"$f":"TCO_1!E31","v":61.984950377692243},{"$f":"TCO_1!E34","v":97.539779421516783},{"$f":"TCO_1!E37","v":45.20717818852512},{"$f":"TCO_1!E40","v":56.717319536775406},null,null,3,{"$f":"IF($C$5=AR13,AL13:AO13,)","v":0}]
[null,null,null,null,null,null,null,null,null,null,null,null,null,null,null,null,null,null,null,null,null,null,null,null,null,null,null,null,null,null,null,null,null,null,null,null,"Year 4",{"$f":"TCO_1!F31","v":51.829827508579243},{"$f":"TCO_1!F34","v":80.651695329746758},{"$f":"TCO_1!F37","v":40.181132154889283},{"$f":"TCO_1!F40","v":50.677335562277811},null,null,4,{"$f":"IF($C$5=AR14,AL14:AO14,)","v":0}]
[null,null,"INR",null,null,null,null,null,null,null,null,null,null,null,null,null,null,null,null,null,null,null,null,null,null,null,null,null,null,null,null,null,null,null,null,null,"Year 5",{"$f":"TCO_1!G31","v":45.526355098889546},{"$f":"TCO_1!G34","v":70.271360549335839},{"$f":"TCO_1!G37","v":36.776722138981015},{"$f":"TCO_1!G40","v":46.540329695030778},null,null,5,{"$f":"IF($C$5=AR15,AL15:AO15,)","v":45.526355098889546},70.271360549335839,36.776722138981015,46.540329695030778]
{"$rows_left_out":47}
{"sheet":"Summary","index":2,"n_rows":29,"n_cols":5,"rows_kept":29,"cut":false,"hidden":false,"merged":[[0,0,0,1],[10,0,10,4],[18,0,18,4],[26,0,26,4]]}
["TRAVEL DETAILS"]
["Number of Vehicle",1]
["Life of Vehicle (yrs)",10]
["Annual drive distance (KM)",{"$f":"'HCFV TCO Dashboard'!C10","v":94500}]
["Total Distance Travel (KM)",{"$f":"B3*B4","v":945000}]
["LIB Cost (USD/kWh)",{"$f":"'HCFV TCO Dashboard'!C40","v":137}]
["USD to INR",73]
["General Inputs","e-HCFV (LT)","e-HCFV (HT)","D-HCFV (LT)","D-HCFV (HT)"]
["Discount rate (%)",{"$f":"'HCFV TCO Dashboard'!C25","v":0.1},{"$f":"'HCFV TCO Dashboard'!D25","v":0.1},{"$f":"'HCFV TCO Dashboard'!E25","v":0.1},{"$f":"'HCFV TCO Dashboard'!F25","v":0.1}]
["Resale rate (%)",{"$f":"'HCFV TCO Dashboard'!C26","v":0.2},{"$f":"'HCFV TCO Dashboard'!D26","v":0.2},{"$f":"'HCFV TCO Dashboard'!E26","v":0.1},{"$f":"'HCFV TCO Dashboard'!F26","v":0.1}]
[]
["Capital Cost","e-HCFV (LT)","e-HCFV (HT)","D - HCFV (LT)","D - HCFV (HT)"]
["Total Vehicle Cost (₹)",{"$f":"'Capital Cost'!B8","v":8826805.2550157513},{"$f":"'Capital Cost'!C8","v":13926449.366846293},{"$f":"'Capital Cost'!D8","v":4657207.4447929123},{"$f":"'Capital Cost'!E8","v":5435381.8777236994}]
["Resale Value (₹)",{"$f":"B13*B10","v":1765361.0510031504},{"$f":"C13*C10","v":2785289.8733692588},{"$f":"D13*D10","v":465720.74447929126},{"$f":"E13*E10","v":543538.18777236994}]
["Total Charging Infrastructure Cost (₹/Vehicle)",{"$f":"'HCFV TCO Dashboard'!C33/Summary!B2","v":3231000},{"$f":"'HCFV TCO Dashboard'!D33/Summary!B2","v":6300000},{"$f":"'Capital Cost'!D19/B2","v":0},{"$f":"'Capital Cost'!E19/B2","v":0}]
{"$rows_left_out":15}
{"sheet":"Currency","index":3,"n_rows":55,"n_cols":12,"rows_kept":55,"cut":false,"hidden":true,"merged":[[1,1,1,3],[15,1,15,2],[15,4,15,5],[15,7,15,8],[15,10,15,11]]}
[]
[null,"CURRENCY CONVERSION"]
[]
[null,"USD","INR","Conversion"]
[null,1,73,{"$f":"B5*C5","v":73}]
[]
[null,"EURO","INR","Conversion"]
[null,1,82,{"$f":"B8*C8","v":82}]
[]
[]
[]
[]
[]
[]
[]
{"$rows_left_out":41}
{"sheet":"Capital Cost","index":4,"n_rows":45,"n_cols":5,"rows_kept":45,"cut":false,"hidden":true,"merged":[[51,0,51,4],[26,0,26,4],[31,0,31,4],[36,0,36,4],[41,0,41,4],[46,0,46,4]]}
["Vehicle Cost","e-HCFV (LT)","e-HCFV (HT)","D-HCFV (LT)","D-HCFV (HT)"]
["Purchase Cost (₹)",{"$f":"VLOOKUP('HCFV TCO Dashboard'!$C$15,'Capital Cost'!$A$28:$E$30,2,0)","v":7000000},{"$f":"VLOOKUP('HCFV TCO Dashboard'!$C$15,'Capital Cost'!$A$28:$E$30,3,0)","v":11050000},{"$f":"VLOOKUP('HCFV TCO Dashboard'!$C$15,'Capital Cost'!$A$28:$E$30,4,0)","v":3370000},{"$f":"VLOOKUP('HCFV TCO Dashboard'!$C$15,'Capital Cost'!$A$28:$E$30,5,0)","v":3941000}]
["Tax (₹)",{"$f":"VLOOKUP('HCFV TCO Dashboard'!$C$15,'Capital Cost'!$A$33:$E$35,2,0)","v":0},{"$f":"VLOOKUP('HCFV TCO Dashboard'!$C$15,'Capital Cost'!$A$33:$E$35,3,0)","v":0},{"$f":"VLOOKUP('HCFV TCO Dashboard'!$C$15,'Capital Cost'!$A$33:$E$35,4,0)","v":44147},{"$f":"VLOOKUP('HCFV TCO Dashboard'!$C$15,'Capital Cost'!$A$33:$E$35,5,0)","v":42545}]
["Insurance (₹)",{"$f":"VLOOKUP('HCFV TCO Dashboard'!$C$15,'Capital Cost'!$A$38:$E$40,2,0)","v":67050},{"$f":"VLOOKUP('HCFV TCO Dashboard'!$C$15,'Capital Cost'!$A$38:$E$40,3,0)","v":98550},{"$f":"VLOOKUP('HCFV TCO Dashboard'!$C$15,'Capital Cost'!$A$38:$E$40,4,0)","v":47965},{"$f":"VLOOKUP('HCFV TCO Dashboard'!$C$15,'Capital Cost'!$A$38:$E$40,5,0)","v":54249}]
["Financing Component (₹)",{"$f":"Financing!B17","v":1759755.2550157513},{"$f":"Financing!C17","v":2777899.3668462932},{"$f":"Financing!D17","v":1195095.4447929123},{"$f":"Financing!E17","v":1397587.8777236994}]
["Total Financial Incentive (₹)",0,0,0,0]
["Misc. Cost (₹)",0,0,0,0]
["Total Vehicle Cost (₹)",{"$f":"((B2+B3+B4+B5+B7)-B6)","v":8826805.2550157513},{"$f":"((C2+C3+C4+C5+C7)-C6)","v":13926449.366846293},{"$f":"((D2+D3+D4+D5+D7)-D6)","v":4657207.4447929123},{"$f":"((E2+E3+E4+E5+E7)-E6)","v":5435381.8777236994}]
[]
["Charging Infrastructure Cost","e-HCFV (LT)","e-HCFV (HT)","D-HCFV (LT)","D-HCFV (HT)"]
["No. of Slow Charger (SC)",1,0,0,0]
["Cost of SC per unit (₹)",1800000,1800000,0,0]
["Total Cost of SC (₹)",{"$f":"B11*B12","v":1800000},{"$f":"C11*C12","v":0},{"$f":"D11*D12","v":0},0]
["No. of Fast Charger (FC)",0.17,1,0,0]
["Cost of FC per unit (₹)",5250000,5250000,0,0]
{"$rows_left_out":31}
{"sheet":"Operational Cost","index":5,"n_rows":47,"n_cols":5,"rows_kept":47,"cut":false,"hidden":true,"merged":[[33,0,33,4],[38,0,38,4],[43,0,43,4]]}
["Staff cost","e-HCFV (LT)","e-HCFV (HT)","D-HCFV (LT)","D-HCFV (HT)"]
["Staff Cost (₹ / Month)",{"$f":"'HCFV TCO Dashboard'!C39","v":50000},{"$f":"'HCFV TCO Dashboard'!C39","v":50000},{"$f":"'HCFV TCO Dashboard'!C39","v":50000},{"$f":"'HCFV TCO Dashboard'!C39","v":50000}]
["Other Support staff cost (₹ / Month)",0,0,0,0]
["Total Annual Staff Cost (₹)",{"$f":"((B2+B3)*12)","v":600000},{"$f":"((C2+C3)*12)","v":600000},600000,600000]
["Per km Staff Cost",{"$f":"B4/Summary!$B$4","v":6.3492063492063489},{"$f":"C4/Summary!$B$4","v":6.3492063492063489},{"$f":"D4/Summary!$B$4","v":6.3492063492063489},{"$f":"E4/Summary!$B$4","v":6.3492063492063489}]
[]
["Average Fuel Cost","e-HCFV (LT)","e-HCFV (HT)","D-HCFV (LT)","D-HCFV (HT)"]
["Fuel cost (₹/kWh; ₹/L)",{"$f":"VLOOKUP('HCFV TCO Dashboard'!$C$15,'Operational Cost'!$A$45:$E$47,2,0)","v":6},{"$f":"VLOOKUP('HCFV TCO Dashboard'!$C$15,'Operational Cost'!$A$45:$E$47,3,0)","v":6},{"$f":"VLOOKUP('HCFV TCO Dashboard'!$C$15,'Operational Cost'!$A$45:$E$47,4,0)","v":89},{"$f":"VLOOKUP('HCFV TCO Dashboard'!$C$15,'Operational Cost'!$A$45:$E$47,5,0)","v":89}]
["Mileage (km/kWh; km/L)",{"$f":"'HCFV TCO Dashboard'!C46","v":0.7},{"$f":"'HCFV TCO Dashboard'!D46","v":0.55000000000000004},{"$f":"'HCFV TCO Dashboard'!E46","v":3.5},{"$f":"'HCFV TCO Dashboard'!F46","v":2.5}]
["Annual fuel consumption (kWh; L)",{"$f":"Summary!B4/B9","v":135000},{"$f":"Summary!B4/C9","v":171818.18181818179},{"$f":"Summary!B4/D9","v":27000},{"$f":"Summary!$B$4/E9","v":37800}]
["Total Annual Fuel Cost ( ₹ )",{"$f":"(B10*B8)","v":810000},{"$f":"(C10*C8)","v":1030909.0909090908},{"$f":"(D10*D8)","v":2403000},{"$f":"(E10*E8)","v":3364200}]
["Per km Fuel Cost",{"$f":"B11/Summary!$B$4","v":8.5714285714285712},{"$f":"C11/Summary!$B$4","v":10.909090909090908},{"$f":"D11/Summary!$B$4","v":25.428571428571427},{"$f":"E11/Summary!$B$4","v":35.6}]
[]
["Maintenance Cost","e-HCFV (LT)","e-HCFV (HT)","D-HCFV (LT)","D-HCFV (HT)"]
["Annual Maintenance Cost (₹)",{"$f":"VLOOKUP('HCFV TCO Dashboard'!$C$15,'Operational Cost'!$A$40:$E$42,2,0)","v":30500},{"$f":"VLOOKUP('HCFV TCO Dashboard'!$C$15,'Operational Cost'!$A$40:$E$42,3,0)","v":32000},{"$f":"VLOOKUP('HCFV TCO Dashboard'!$C$15,'Operational Cost'!$A$40:$E$42,4,0)","v":61172},{"$f":"VLOOKUP('HCFV TCO Dashboard'!$C$15,'Operational Cost'!$A$40:$E$42,5,0)","v":63000}]
{"$rows_left_out":33}
{"sheet":"Financing","index":6,"n_rows":24,"n_cols":5,"rows_kept":24,"cut":false,"hidden":true,"merged":[[20,0,20,4],[25,0,25,4]]}
["Vehicle Cost","e-HCFV (LT)","e-HCFV (HT)","D-HCFV (LT)","D-HCFV (HT)"]
["Total Cost of HCFV (₹)",{"$f":"'HCFV TCO Dashboard'!C20-'HCFV TCO Dashboard'!C23","v":7000000},{"$f":"'HCFV TCO Dashboard'!D20","v":11050000},{"$f":"'HCFV TCO Dashboard'!E20","v":3370000},{"$f":"'HCFV TCO Dashboard'!F20","v":3941000}]
["Share of Operator (%)",{"$f":"100%-B6","v":0.8},{"$f":"100%-C6","v":0.8},0.8,0.8]
["Share of Operator (₹)",{"$f":"B3*B2","v":5600000},{"$f":"C3*C2","v":8840000},{"$f":"D3*D2","v":2696000},{"$f":"E3*E2","v":3152800}]
["Processing  Fees",{"$f":"IF(B8=0,0,IF(B4*0.5%>500,B4*0.5%,500))","v":28000},{"$f":"IF(C8=0,0,IF(C4*0.5%>500,C4*0.5%,500))","v":44200},13480,15764]
["Equity %",{"$f":"'HCFV TCO Dashboard'!C31","v":0.2},{"$f":"'HCFV TCO Dashboard'!D31","v":0.2},{"$f":"'HCFV TCO Dashboard'!E31","v":0.2},{"$f":"'HCFV TCO Dashboard'!F31","v":0.2}]
["Equity (₹)",{"$f":"(B6*B2)","v":1400000},{"$f":"(C6*C2)","v":2210000},{"$f":"(D6*D2)","v":674000},{"$f":"(E6*E2)","v":788200}]
["Loan amount (₹)",{"$f":"B4","v":5600000},{"$f":"C4","v":8840000},{"$f":"D4","v":2696000},{"$f":"E4","v":3152800}]
["Interest rate (%)",{"$f":"'HCFV TCO Dashboard'!C30","v":0.08},{"$f":"'HCFV TCO Dashboard'!D30","v":0.08},{"$f":"'HCFV TCO Dashboard'!E30","v":0.11},{"$f":"'HCFV TCO Dashboard'!F30","v":0.11}]
["Term of payment (yrs)",{"$f":"'HCFV TCO Dashboard'!C29","v":7},{"$f":"'HCFV TCO Dashboard'!D29","v":7},{"$f":"'HCFV TCO Dashboard'!E29","v":7},{"$f":"'HCFV TCO Dashboard'!F29","v":7}]
["No of EMI (Yearly)",{"$f":"B10*12","v":84},{"$f":"C10*12","v":84},84,84]
["Monthly EMI Loan (Rs.)",{"$f":"((PMT(B9/12,B10*12,-B8))+(B5/B11))","v":87616.13398828276},{"$f":"((PMT(C9/12,C10*12,-C8))+(C5/C11))","v":138308.32579578922},46322.564818963241,54171.284258615473]
["Total interest paid",{"$f":"(B12*B10*12)-B8","v":1759755.2550157513},{"$f":"(C12*C10*12)-C8","v":2777899.3668462932},1195095.4447929123,1397587.8777236994]
["Yearly Interest Paid",{"$f":"B13/B10","v":251393.60785939306},{"$f":"C13/C10","v":396842.76669232763},{"$f":"D13/D10","v":170727.92068470176},{"$f":"E13/E10","v":199655.41110338565}]
["EMI per KM (Rs.)",{"$f":"B14/Summary!B4","v":2.660249818617916},{"$f":"C14/Summary!B4","v":4.1993943565325678},{"$f":"D14/Summary!B4","v":1.8066446633301774},{"$f":"E14/Summary!B4","v":2.1127556730517001}]
{"$rows_left_out":10}
{"sheet":"TCO_1","index":7,"n_rows":40,"n_cols":13,"rows_kept":40,"cut":false,"hidden":true,"merged":[]}
["Parameter","Unit","e-HCFV (LT)","e-HCFV (HT)","D-HCFV (LT)","D-HCFV (HT)"]
["Discount rate value","-",{"$f":"Summary!B9","v":0.1},{"$f":"Summary!C9","v":0.1},{"$f":"Summary!D9","v":0.1},{"$f":"Summary!E9","v":0.1}]
["Resale rate value","-",{"$f":"Summary!B10","v":0.2},{"$f":"Summary!C10","v":0.2},{"$f":"Summary!D10","v":0.1},{"$f":"Summary!E10","v":0.1}]
["Capital recovery factor (CRF)_N","-",{"$f":"C2*(1+C2)^Summary!B3","v":0.2593742460100002},{"$f":"D2*(1+D2)^Summary!B3","v":0.2593742460100002},{"$f":"E2*(1+E2)^Summary!B3","v":0.2593742460100002},{"$f":"F2*(1+F2)^Summary!B3","v":0.2593742460100002}]
["Capital recovery factor (CRF)_D","-",{"$f":"((1+C2)^Summary!B3)-1","v":1.5937424601000019},{"$f":"(1+D2)^Summary!B3-1","v":1.5937424601000019},{"$f":"(1+E2)^Summary!B3-1","v":1.5937424601000019},{"$f":"(1+F2)^Summary!B3-1","v":1.5937424601000019}]
["CRF","-",{"$f":"C4/C5","v":0.16274539488251155},{"$f":"D4/D5","v":0.16274539488251155},{"$f":"E4/E5","v":0.16274539488251155},{"$f":"F4/F5","v":0.16274539488251155}]
["Present value factor (PVF)","-",{"$f":"1/(1+C2)^10","v":0.38554328942953148},{"$f":"1/(1+D2)^Summary!B3","v":0.38554328942953148},{"$f":"1/(1+E2)^Summary!B3","v":0.38554328942953148},{"$f":"1/(1+F2)^Summary!B3","v":0.38554328942953148}]
["Residual value (RV)","₹",{"$f":"Summary!B13*C3","v":1765361.0510031504},{"$f":"Summary!C13*D3","v":2785289.8733692588},{"$f":"Summary!D13*E3","v":465720.74447929126},{"$f":"Summary!E13*F3","v":543538.18777236994}]
["Annual  Travel Distance","km",{"$f":"Summary!$B$4","v":94500},{"$f":"Summary!$B$4","v":94500},{"$f":"Summary!$B$4","v":94500},{"$f":"Summary!$B$4","v":94500}]
["Capex component","₹",{"$f":"((Summary!B18-(C8*C7))*C6)","v":1851584.0013885631},{"$f":"(Summary!C18-(D8*D7))*D6","v":3116997.376311711},{"$f":"(Summary!D18-(E8*E7))*E6","v":728717.23263526475},{"$f":"(Summary!E18-(F8*F7))*F6","v":850478.85180188855}]
["TCO","₹/km",{"$f":"(C10+L22)/C9","v":31.691074270759394},{"$f":"(D10+L23)/D9","v":48.088518618083015},{"$f":"(E10+L24)/E9","v":27.635114078067698},{"$f":"(F10+L25)/F9","v":35.185385360965903}]
[]
["Opex / year"]
["Vehicle type","Unit",1,{"$f":"C14+1","v":2},3,4,5,6,7,8,9,10,"Total"]
["e-HCFV (LT)","₹",{"$f":"Summary!$B$26/(1+$C$2)^C14","v":1691401.8181818181},{"$f":"Summary!$B$26/(1+$C$2)^D14","v":1537638.0165289254},{"$f":"Summary!$B$26/(1+$C$2)^E14","v":1397852.7422990229},{"$f":"Summary!$B$26/(1+$C$2)^F14","v":1270775.2202718391},{"$f":"Summary!$B$26/(1+$C$2)^G14","v":1155250.2002471264},{"$f":"Summary!$B$26/(1+$C$2)^H14","v":1050227.4547701147},{"$f":"Summary!$B$26/(1+$C$2)^I14","v":954752.23160919501},{"$f":"Summary!$B$26/(1+$C$2)^J14","v":867956.57419017737},{"$f":"Summary!$B$26/(1+$C$2)^K14","v":789051.4310819793},{"$f":"Summary!$B$26/(1+$C$2)^L14","v":717319.48280179931},{"$f":"SUM(C15:L15)/Summary!B3","v":1143222.5171981996}]
{"$rows_left_out":25}